{"text_format":"3","workbook":"xlsx","n_sheets":49,"sheets":["coverSheet","Summary","definitions","Tables from ISO 12216","Worksheet 1","main Side windows 1","basic design pressure 1","Worksheet 2","main Side windows 2","basic design pressure 2","Worksheet 3","main Side windows 3","basic design pressure 3","Worksheet 4","main Side windows 4","basic design pressure 4","Worksheet 5","main Side windows 5","basic design pressure 5","Worksheet 6","main Side windows 6","basic design pressure 6","Worksheet 7","main Side windows 7","basic design pressure 7","Worksheet 8","main Side windows 8","basic design pressure 8","Worksheet 9","main Side windows 9","basic design pressure 9","Worksheet 10","main Side windows 10","basic design pressure 10","Worksheet 11","main Side windows 11","basic design pressure 11","Worksheet 12","main Side windows 12","basic design pressure 12","Worksheet 13","main Side windows 13","basic design pressure 13","Worksheet 14","main Side windows 14","basic design pressure 14","Worksheet 15","main Side windows 15","basic design pressure 15"],"not_rendered":{"images":17,"defined_names":35,"comments":32},"read":"whole","date_system":"1900"}

{"sheet":"coverSheet","index":0,"n_rows":28,"n_cols":1,"rows_kept":28,"merged":[[2,0,2,5],[4,1,4,5],[5,1,5,5],[6,1,6,5],[7,1,7,5],[8,1,8,5],[9,1,9,5],[10,1,10,5],[11,1,11,5],[13,0,13,5],[16,0,17,5],[19,0,19,5],[21,0,21,5],[23,0,23,5],[25,0,25,5],[27,0,27,5]]}
[]
[]
["ISO 12216:2020 - Small craft - Windows, portlights, hatches, deadlights and doors\n- Strength and watertightness requirements"]
[]
["Manufacturer:"]
["Signatory, Name:"]
["Signatory, Title:"]
["Phone:"]
["Email:"]
["WWW:"]
["CIN Model Year:"]
["Model Name:"]
[]
["This calculation sheet is provided by IMCI \"as is\" and any express or implied warranties, including, but not limited to, the implied warranties of fitness for a particular purpose are disclaimed."]
[]
[]
["- Please send technical drawings and material data sheets for all appliances"]
[]
[]
[" -  ISO 12216:2020 has many different requirements for appliances, depending often on a combination of design category, boat type, area where the appliance is installed, size of the appliance..... \nIf one of the requirements (e.g. the glass thickness) is fulfilled and this worksheet shows a green \"passed\" for this one requirement, this does not mean that all other requirements for this appliance are fulfilled. \nCarefully check all other requirements of the standard and do not rely on this tool to check all standard requirements."]
[]
[" -  Please check the checks listed on the right side of the calculations for the various other requirements of the ISO 12216:2020 standard. In case of red marked warnings, please check the input values; in case of doubt, please contact the IMCI head office."]
[]
[" -  Please check for every window, portlight or hatch, if ISO 12216 has other/additional restrictions/requirements besides the required thickness calculation and the listed checks !! \nThis worksheet cannot check all possible combinations of support/design category/area/craft type"]
[]
["  - Please find detailed information about definitions of areas on worksheet definitions"]
[]
["- Please send questions, found errors, typos, mistakes, ect. directly to ralf.dewender@imci.org or to the headoffice with info@imci.org; every comment helps us to provide you with an emended version."]

{"sheet":"Summary","index":1,"n_rows":26,"n_cols":83,"rows_kept":26,"merged":[[1,1,1,20],[1,21,1,36],[2,1,2,20],[2,21,2,36],[3,1,3,4],[4,1,4,20],[4,21,4,36],[10,45,11,51],[12,45,12,49],[13,45,14,51],[18,45,20,51]]}
[]
[null,"ISO 12216:2020 - Small craft - Windows, portlights, hatches, deadlights and doors",{"$nulls":19},"ISO 12216:2020 - Small craft - Windows, portlights, hatches, deadlights and doors"]
[null,"WORKSHEET No. 1 data entry Summary",{"$nulls":19},"WORKSHEET No. 2 Results"]
[null,"ISO 12216 en240408"]
[null,{"$f":"CONCATENATE(coverSheet!B5,\"   \",coverSheet!B12)","v":"   "},{"$nulls":19},{"$f":"CONCATENATE(coverSheet!B5,\"   \",coverSheet!B12)","v":"   "},{"$nulls":16},"These tests do NOT cover all the requirements of ISO 12216:2020, but only the most frequently occurring problem cases"]
[]
[null,"Basic data ",{"$nulls":19},"Results for non-stiffened plates",{"$nulls":6},"Results for non-stiffened plates, calculation values"]
[null,"Name","Form of plate \n[rectangular / circle]","Long side\n[mm]","Unsupported short side\n[mm]","Diameter\n[mm]","Curve height\n[mm]","Semi-fixed or \nsimply supported","Location type","Location area \n(only loc. III)","Design Category","Craft Type \n[Any/Motor/Sail]","Is boat a sailing multihull ?","Length of hull as in \nISO 8666 [m]","Material","Tech. Minimum according to clause 7.2 used?","Is actual plate a sandwich?","If yes, enter number of layers","Thickness interlayer [mm]","Is glass high-impact-resistance glass?","Actual plate thickness [mm]","Required plate thickness [mm]","Requirements fullfilled?","Thickness (Stress) \n[mm]","Thickness (Deflection) [mm]","Required thickness [mm]","Thickness minimu, techn. [mm]","Thickness minimum, Tab 5 \n[mm]","Press reduction factor","Press reduction within limits 0,33 and 1,0","Basic design press","Allowable flexural stress","Curvature coefficient","Ratio a/b \n(valid ≤ 5)","Ratio a/b \ncorrected","Plate aspect ratio coefficient stress","Pate aspect ratio coefficient deflection",null,"Check interlayer","Check sliding appliances\n in area I","Check simply supported plates in area I \n(for sail monohulls in category A&B, for motorboats & sail multihulls in category A)","Check of maximum dimensions for glazing in \nhull area I","Check of monolitic CG glass","Check of use of glass\n (see corresponding standard text on the right side)"]
["No.1",{"$nulls":20},{"$f":"IF(AND(D9=\"\",F9=\"\"),\"\",'Worksheet 1'!$I$44)","v":""},{"$f":"IF(AND(I9=\"I\",OR(O9=\"TG\",O9=\"CG\"),OR(Q9=\"no\",Q9=\"\")),\"FAIL\",IF(AE9=\"insert loc. Area\",\"Fail\",IF(AND(Q9=\"yes\",R9=\"\"),\"ERROR\",IF(AND(D9=\"\",F9=\"\"),\"\",'Worksheet 1'!$I$45))))","v":""},{"$f":"IF(AND(D9=\"\",F9=\"\"),\"\",'Worksheet 1'!$I$38)","v":""},{"$f":"IF(AND(D9=\"\",F9=\"\"),\"\",'Worksheet 1'!$I$39)","v":""},{"$f":"IF(AND(D9=\"\",F9=\"\"),\"\",'Worksheet 1'!$I$40)","v":""},{"$f":"IF(AND(D9=\"\",F9=\"\"),\"\",'Worksheet 1'!$I$41)","v":""},{"$f":"IF(AND(D9=\"\",F9=\"\"),\"\",'Worksheet 1'!$I$42)","v":""},{"$f":"IF(AND(D9=\"\",F9=\"\"),\"\",'Worksheet 1'!$I$28)","v":""},{"$f":"IF(AND(D9=\"\",F9=\"\"),\"\",'Worksheet 1'!$I$29)","v":""},{"$f":"IF(AND(I9=\"III\",J9=\"\"),\"insert loc. Area\",IF(AND(D9=\"\",F9=\"\"),\"\",'Worksheet 1'!$I$30))","v":""},{"$f":"IF(AND(D9=\"\",F9=\"\"),\"\",'Worksheet 1'!$I$31)","v":""},{"$f":"IF(AND(D9=\"\",F9=\"\"),\"\",'Worksheet 1'!$I$32)","v":""},{"$f":"IF(AND(D9=\"\",F9=\"\"),\"\",'Worksheet 1'!$I$33)","v":""},{"$f":"IF(AND(D9=\"\",F9=\"\"),\"\",'Worksheet 1'!$I$34)","v":""},{"$f":"IF(AND(D9=\"\",F9=\"\"),\"\",'Worksheet 1'!$I$35)","v":""},{"$f":"IF(AND(D9=\"\",F9=\"\"),\"\",'Worksheet 1'!$I$36)","v":""},null,{"$f":"IF(Q9=\"\",\"\",IF(AND(Q9=\"Yes\",S9=\"\"),\"insert interlayer thickness\",IF(S9>0.76,\"interlayer thicker 0,76mm, please use alternative calculation methods\",\"ok\")))","v":""},{"$f":"IF(AND(I9=\"I\",H9=\"simply supported\"),\"Attention, if sliding appliances, it shall not be used in area I\",\"\")","v":""},{"$f":"IF(OR((AND(H9=\"simply supported\",L9=\"Sail\",OR(K9=\"A\",K9=\"B\"),M9<>\"yes\",I9=\"I\")),(AND(H9=\"simply supported\",L9=\"Sail\",K9=\"A\",M9=\"yes\",I9=\"I\")),(AND(H9=\"simply supported\",L9=\"Motor\",K9=\"A\",I9=\"I\"))),\"simply supported plates shall not be used in area I\",\"\")","v":""},{"$f":"IF(I9<>\"I\",\"\",IF(OR(E9>600,F9>600),\"unsupported short side too long\",IF(OR(AND(C9=\"rectangular\",D9*E9>852000),AND(C9=\"circle\",(F9/2)^2*PI()>852000)),\"size too big for area I\",IF(AND(Q9<>\"yes\",E9>300),\"unsupported short side too long\",\"\"))))","v":""},{"$f":"IF(AND(O9=\"CG\",OR(Q9=\"\",Q9=\"no\")),\"use of monolithic chemically reinforced glass is not allowed\",\"\")","v":""},{"$f":"IF(AND(I9=\"IIa\",L9=\"sail\",OR(O9=\"TG\",O9=\"CG\"),OR(T9=\"\",T9=\"no\")),\"check if glas is fwd of the mast\",IF(AND(I9=\"I\",L9=\"sail\",OR(T9=\"\",T9=\"no\"),OR(O9=\"TG\",O9=\"CG\")),\"glass shall not be used\",IF(AND(I9=\"I\",OR(T9=\"\",T9=\"no\"),OR(L9=\"any\",L9=\"motor\"),OR(K9=\"A\",K9=\"B\"),OR(O9=\"TG\",O9=\"CG\")),\"glass shall not be used\",\"\")))","v":""},null,"6.3.1 Appliances fitted in area I",{"$nulls":33},"List"]
["No.2",{"$nulls":9},{"$f":"$K$9","v":0},{"$f":"$L$9","v":0},{"$f":"M9","v":0},{"$f":"$N$9","v":{"v":0,"d":"0.00"}},{"$nulls":7},{"$f":"IF(AND(D10=\"\",F10=\"\"),\"\",'Worksheet 2'!$I$44)","v":""},{"$f":"IF(AND(I10=\"I\",OR(O10=\"TG\",O10=\"CG\"),OR(Q10=\"no\",Q10=\"\")),\"FAIL\",IF(AE10=\"insert loc. Area\",\"Fail\",IF(AND(Q10=\"yes\",R10=\"\"),\"ERROR\",IF(AND(D10=\"\",F10=\"\"),\"\",'Worksheet 2'!$I$45))))","v":""},{"$f":"IF(AND(D10=\"\",F10=\"\"),\"\",'Worksheet 2'!$I$38)","v":""},{"$f":"IF(AND(D10=\"\",F10=\"\"),\"\",'Worksheet 2'!$I$39)","v":""},{"$f":"IF(AND(D10=\"\",F10=\"\"),\"\",'Worksheet 2'!$I$40)","v":""},{"$f":"IF(AND(D10=\"\",F10=\"\"),\"\",'Worksheet 2'!$I$41)","v":""},{"$f":"IF(AND(D10=\"\",F10=\"\"),\"\",'Worksheet 2'!$I$42)","v":""},{"$f":"IF(AND(D10=\"\",F10=\"\"),\"\",'Worksheet 2'!$I$28)","v":""},{"$f":"IF(AND(D10=\"\",F10=\"\"),\"\",'Worksheet 2'!$I$29)","v":""},{"$f":"IF(AND(I10=\"III\",J10=\"\"),\"insert loc. Area\",IF(AND(D10=\"\",F10=\"\"),\"\",'Worksheet 2'!$I$30))","v":""},{"$f":"IF(AND(D10=\"\",F10=\"\"),\"\",'Worksheet 2'!$I$31)","v":""},{"$f":"IF(AND(D10=\"\",F10=\"\"),\"\",'Worksheet 2'!$I$32)","v":""},{"$f":"IF(AND(D10=\"\",F10=\"\"),\"\",'Worksheet 2'!$I$33)","v":""},{"$f":"IF(AND(D10=\"\",F10=\"\"),\"\",'Worksheet 2'!$I$34)","v":""},{"$f":"IF(AND(D10=\"\",F10=\"\"),\"\",'Worksheet 2'!$I$35)","v":""},{"$f":"IF(AND(D10=\"\",F10=\"\"),\"\",'Worksheet 2'!$I$36)","v":""},null,{"$f":"IF(Q10=\"\",\"\",IF(AND(Q10=\"Yes\",S10=\"\"),\"insert interlayer thickness\",IF(S10>0.76,\"interlayer thicker 0,76mm, please use alternative calculation methods\",\"ok\")))","v":""},{"$f":"IF(AND(I10=\"I\",H10=\"simply supported\"),\"Attention, if sliding appliances, it shall not be used in area I\",\"\")","v":""},{"$f":"IF(OR((AND(H10=\"simply supported\",L10=\"Sail\",OR(K10=\"A\",K10=\"B\"),M10<>\"yes\",I10=\"I\")),(AND(H10=\"simply supported\",L10=\"Sail\",K10=\"A\",M10=\"yes\",I10=\"I\")),(AND(H10=\"simply supported\",L10=\"Motor\",K10=\"A\",I10=\"I\"))),\"simply supported plates shall not be used in area I\",\"\")","v":""},{"$f":"IF(I10<>\"I\",\"\",IF(OR(E10>600,F10>600),\"unsupported short side too long\",IF(OR(AND(C10=\"rectangular\",D10*E10>852000),AND(C10=\"circle\",(F10/2)^2*PI()>852000)),\"size too big for area I\",IF(AND(Q10<>\"yes\",E10>300),\"unsupported short side too long\",\"\"))))","v":""},{"$f":"IF(AND(O10=\"CG\",OR(Q10=\"\",Q10=\"no\")),\"use of monolithic chemically reinforced glass is not allowed\",\"\")","v":""},"",null,"6.3.1.1.1 Maximum small side dimension for glazing in the hull.",{"$nulls":33},"Lists"]
["No.3",{"$nulls":9},{"$f":"$K$9","v":0},{"$f":"$L$9","v":0},{"$f":"M10","v":0},{"$f":"$N$9","v":{"v":0,"d":"0.00"}},{"$nulls":7},{"$f":"IF(AND(D11=\"\",F11=\"\"),\"\",'Worksheet 3'!$I$44)","v":""},{"$f":"IF(AND(I11=\"I\",OR(O11=\"TG\",O11=\"CG\"),OR(Q11=\"no\",Q11=\"\")),\"FAIL\",IF(AE11=\"insert loc. Area\",\"Fail\",IF(AND(Q11=\"yes\",R11=\"\"),\"ERROR\",IF(AND(D11=\"\",F11=\"\"),\"\",'Worksheet 3'!$I$45))))","v":""},{"$f":"IF(AND(D11=\"\",F11=\"\"),\"\",'Worksheet 3'!$I$38)","v":""},{"$f":"IF(AND(D11=\"\",F11=\"\"),\"\",'Worksheet 3'!$I$39)","v":""},{"$f":"IF(AND(D11=\"\",F11=\"\"),\"\",'Worksheet 3'!$I$40)","v":""},{"$f":"IF(AND(D11=\"\",F11=\"\"),\"\",'Worksheet 3'!$I$41)","v":""},{"$f":"IF(AND(D11=\"\",F11=\"\"),\"\",'Worksheet 3'!$I$42)","v":""},{"$f":"IF(AND(D11=\"\",F11=\"\"),\"\",'Worksheet 3'!$I$28)","v":""},{"$f":"IF(AND(D11=\"\",F11=\"\"),\"\",'Worksheet 3'!$I$29)","v":""},{"$f":"IF(AND(I11=\"III\",J11=\"\"),\"insert loc. Area\",IF(AND(D11=\"\",F11=\"\"),\"\",'Worksheet 3'!$I$30))","v":""},{"$f":"IF(AND(D11=\"\",F11=\"\"),\"\",'Worksheet 3'!$I$31)","v":""},{"$f":"IF(AND(D11=\"\",F11=\"\"),\"\",'Worksheet 3'!$I$32)","v":""},{"$f":"IF(AND(D11=\"\",F11=\"\"),\"\",'Worksheet 3'!$I$33)","v":""},{"$f":"IF(AND(D11=\"\",F11=\"\"),\"\",'Worksheet 3'!$I$34)","v":""},{"$f":"IF(AND(D11=\"\",F11=\"\"),\"\",'Worksheet 3'!$I$35)","v":""},{"$f":"IF(AND(D11=\"\",F11=\"\"),\"\",'Worksheet 3'!$I$36)","v":""},null,"","","","","","",null,"The maximum unsupported area of any one appliance situated wholly or partly within area I shall be not more than 0,852 m2 (852 000 mm2), and the maximum unsupported ‘b’ (short side) or equivalent ‘b’ dimension shall be not more than 300 mm unless laminated glass is used when the maximum unsupported b (short side) or equivalent b dimension shall be not more than 600 mm.",{"$nulls":32},"rectangular","R","I","A",{"$f":"IF(BI10=\"rectangular\",\"R\",IF(BI10=\"circle\",\"C\",\"\"))","v":""}]
["No.4",{"$nulls":9},0,0,0,{"v":0,"d":"0.00"},{"$nulls":7},{"$f":"IF(AND(D12=\"\",F12=\"\"),\"\",'Worksheet 4'!$I$44)","v":""},{"$f":"IF(AND(I12=\"I\",OR(O12=\"TG\",O12=\"CG\"),OR(Q12=\"no\",Q12=\"\")),\"FAIL\",IF(AE12=\"insert loc. Area\",\"Fail\",IF(AND(Q12=\"yes\",R12=\"\"),\"ERROR\",IF(AND(D12=\"\",F12=\"\"),\"\",'Worksheet 4'!$I$45))))","v":""},{"$f":"IF(AND(D12=\"\",F12=\"\"),\"\",'Worksheet 4'!$I$38)","v":""},{"$f":"IF(AND(D12=\"\",F12=\"\"),\"\",'Worksheet 4'!$I$39)","v":""},{"$f":"IF(AND(D12=\"\",F12=\"\"),\"\",'Worksheet 4'!$I$40)","v":""},{"$f":"IF(AND(D12=\"\",F12=\"\"),\"\",'Worksheet 4'!$I$41)","v":""},{"$f":"IF(AND(D12=\"\",F12=\"\"),\"\",'Worksheet 4'!$I$42)","v":""},{"$f":"IF(AND(D12=\"\",F12=\"\"),\"\",'Worksheet 4'!$I$28)","v":""},{"$f":"IF(AND(D12=\"\",F12=\"\"),\"\",'Worksheet 4'!$I$29)","v":""},{"$f":"IF(AND(I12=\"III\",J12=\"\"),\"insert loc. Area\",IF(AND(D12=\"\",F12=\"\"),\"\",'Worksheet 4'!$I$30))","v":""},{"$f":"IF(AND(D12=\"\",F12=\"\"),\"\",'Worksheet 4'!$I$31)","v":""},{"$f":"IF(AND(D12=\"\",F12=\"\"),\"\",'Worksheet 4'!$I$32)","v":""},{"$f":"IF(AND(D12=\"\",F12=\"\"),\"\",'Worksheet 4'!$I$33)","v":""},{"$f":"IF(AND(D12=\"\",F12=\"\"),\"\",'Worksheet 4'!$I$34)","v":""},{"$f":"IF(AND(D12=\"\",F12=\"\"),\"\",'Worksheet 4'!$I$35)","v":""},{"$f":"IF(AND(D12=\"\",F12=\"\"),\"\",'Worksheet 4'!$I$36)","v":""},null,"","","","","","",{"$nulls":34},"circle","C","IIa","B"]
["No.5",{"$nulls":9},0,0,0,{"v":0,"d":"0.00"},{"$nulls":7},{"$f":"IF(AND(D13=\"\",F13=\"\"),\"\",'Worksheet 5'!$I$44)","v":""},{"$f":"IF(AND(I13=\"I\",OR(O13=\"TG\",O13=\"CG\"),OR(Q13=\"no\",Q13=\"\")),\"FAIL\",IF(AE13=\"insert loc. Area\",\"Fail\",IF(AND(Q13=\"yes\",R13=\"\"),\"ERROR\",IF(AND(D13=\"\",F13=\"\"),\"\",'Worksheet 5'!$I$45))))","v":""},{"$f":"IF(AND(D13=\"\",F13=\"\"),\"\",'Worksheet 5'!$I$38)","v":""},{"$f":"IF(AND(D13=\"\",F13=\"\"),\"\",'Worksheet 5'!$I$39)","v":""},{"$f":"IF(AND(D13=\"\",F13=\"\"),\"\",'Worksheet 5'!$I$40)","v":""},{"$f":"IF(AND(D13=\"\",F13=\"\"),\"\",'Worksheet 5'!$I$41)","v":""},{"$f":"IF(AND(D13=\"\",F13=\"\"),\"\",'Worksheet 5'!$I$42)","v":""},{"$f":"IF(AND(D13=\"\",F13=\"\"),\"\",'Worksheet 5'!$I$28)","v":""},{"$f":"IF(AND(D13=\"\",F13=\"\"),\"\",'Worksheet 5'!$I$29)","v":""},{"$f":"IF(AND(I13=\"III\",J13=\"\"),\"insert loc. Area\",IF(AND(D13=\"\",F13=\"\"),\"\",'Worksheet 5'!$I$30))","v":""},{"$f":"IF(AND(D13=\"\",F13=\"\"),\"\",'Worksheet 5'!$I$31)","v":""},{"$f":"IF(AND(D13=\"\",F13=\"\"),\"\",'Worksheet 5'!$I$32)","v":""},{"$f":"IF(AND(D13=\"\",F13=\"\"),\"\",'Worksheet 5'!$I$33)","v":""},{"$f":"IF(AND(D13=\"\",F13=\"\"),\"\",'Worksheet 5'!$I$34)","v":""},{"$f":"IF(AND(D13=\"\",F13=\"\"),\"\",'Worksheet 5'!$I$35)","v":""},{"$f":"IF(AND(D13=\"\",F13=\"\"),\"\",'Worksheet 5'!$I$36)","v":""},null,"","","","","","",null,"6.3.1.2 Use of glass",{"$nulls":34},"IIb","C"]
["No.6",{"$nulls":9},0,0,0,{"v":0,"d":"0.00"},{"$nulls":7},{"$f":"IF(AND(D14=\"\",F14=\"\"),\"\",'Worksheet 6'!$I$44)","v":""},{"$f":"IF(AND(I14=\"I\",OR(O14=\"TG\",O14=\"CG\"),OR(Q14=\"no\",Q14=\"\")),\"FAIL\",IF(AE14=\"insert loc. Area\",\"Fail\",IF(AND(Q14=\"yes\",R14=\"\"),\"ERROR\",IF(AND(D14=\"\",F14=\"\"),\"\",'Worksheet 6'!$I$45))))","v":""},{"$f":"IF(AND(D14=\"\",F14=\"\"),\"\",'Worksheet 6'!$I$38)","v":""},{"$f":"IF(AND(D14=\"\",F14=\"\"),\"\",'Worksheet 6'!$I$39)","v":""},{"$f":"IF(AND(D14=\"\",F14=\"\"),\"\",'Worksheet 6'!$I$40)","v":""},{"$f":"IF(AND(D14=\"\",F14=\"\"),\"\",'Worksheet 6'!$I$41)","v":""},{"$f":"IF(AND(D14=\"\",F14=\"\"),\"\",'Worksheet 6'!$I$42)","v":""},{"$f":"IF(AND(D14=\"\",F14=\"\"),\"\",'Worksheet 6'!$I$28)","v":""},{"$f":"IF(AND(D14=\"\",F14=\"\"),\"\",'Worksheet 6'!$I$29)","v":""},{"$f":"IF(AND(I14=\"III\",J14=\"\"),\"insert loc. Area\",IF(AND(D14=\"\",F14=\"\"),\"\",'Worksheet 6'!$I$30))","v":""},{"$f":"IF(AND(D14=\"\",F14=\"\"),\"\",'Worksheet 6'!$I$31)","v":""},{"$f":"IF(AND(D14=\"\",F14=\"\"),\"\",'Worksheet 6'!$I$32)","v":""},{"$f":"IF(AND(D14=\"\",F14=\"\"),\"\",'Worksheet 6'!$I$33)","v":""},{"$f":"IF(AND(D14=\"\",F14=\"\"),\"\",'Worksheet 6'!$I$34)","v":""},{"$f":"IF(AND(D14=\"\",F14=\"\"),\"\",'Worksheet 6'!$I$35)","v":""},{"$f":"IF(AND(D14=\"\",F14=\"\"),\"\",'Worksheet 6'!$I$36)","v":""},null,"","","","","","",null,"(in area I) Glass shall not be used on sailing boats of all design categories and on motor boats of design categories A and B, unless the plate is made of high-impact-resistance glass, or if the appliance is equipped with a deadlight meeting the requirements of 6.3.6. High-impact-resistant glass types are listed in Annex E with corresponding requirements.",{"$nulls":34},"III","D"]
["No.7",{"$nulls":9},0,0,0,{"v":0,"d":"0.00"},{"$nulls":7},{"$f":"IF(AND(D15=\"\",F15=\"\"),\"\",'Worksheet 7'!$I$44)","v":""},{"$f":"IF(AND(I15=\"I\",OR(O15=\"TG\",O15=\"CG\"),OR(Q15=\"no\",Q15=\"\")),\"FAIL\",IF(AE15=\"insert loc. Area\",\"Fail\",IF(AND(Q15=\"yes\",R15=\"\"),\"ERROR\",IF(AND(D15=\"\",F15=\"\"),\"\",'Worksheet 7'!$I$45))))","v":""},{"$f":"IF(AND(D15=\"\",F15=\"\"),\"\",'Worksheet 7'!$I$38)","v":""},{"$f":"IF(AND(D15=\"\",F15=\"\"),\"\",'Worksheet 7'!$I$39)","v":""},{"$f":"IF(AND(D15=\"\",F15=\"\"),\"\",'Worksheet 7'!$I$40)","v":""},{"$f":"IF(AND(D15=\"\",F15=\"\"),\"\",'Worksheet 7'!$I$41)","v":""},{"$f":"IF(AND(D15=\"\",F15=\"\"),\"\",'Worksheet 7'!$I$42)","v":""},{"$f":"IF(AND(D15=\"\",F15=\"\"),\"\",'Worksheet 7'!$I$28)","v":""},{"$f":"IF(AND(D15=\"\",F15=\"\"),\"\",'Worksheet 7'!$I$29)","v":""},{"$f":"IF(AND(I15=\"III\",J15=\"\"),\"insert loc. Area\",IF(AND(D15=\"\",F15=\"\"),\"\",'Worksheet 7'!$I$30))","v":""},{"$f":"IF(AND(D15=\"\",F15=\"\"),\"\",'Worksheet 7'!$I$31)","v":""},{"$f":"IF(AND(D15=\"\",F15=\"\"),\"\",'Worksheet 7'!$I$32)","v":""},{"$f":"IF(AND(D15=\"\",F15=\"\"),\"\",'Worksheet 7'!$I$33)","v":""},{"$f":"IF(AND(D15=\"\",F15=\"\"),\"\",'Worksheet 7'!$I$34)","v":""},{"$f":"IF(AND(D15=\"\",F15=\"\"),\"\",'Worksheet 7'!$I$35)","v":""},{"$f":"IF(AND(D15=\"\",F15=\"\"),\"\",'Worksheet 7'!$I$36)","v":""},null,"","","","","","",{"$nulls":34},"semi-fixed","SF","IV",null,{"$f":"IF(BI15=\"semi-fixed\",\"SF\",IF(BI15=\"\",\"\",\"SS\"))","v":""}]
["No.8",{"$nulls":9},0,0,0,{"v":0,"d":"0.00"},{"$nulls":7},{"$f":"IF(AND(D16=\"\",F16=\"\"),\"\",'Worksheet 8'!$I$44)","v":""},{"$f":"IF(AND(I16=\"I\",OR(O16=\"TG\",O16=\"CG\"),OR(Q16=\"no\",Q16=\"\")),\"FAIL\",IF(AE16=\"insert loc. Area\",\"Fail\",IF(AND(Q16=\"yes\",R16=\"\"),\"ERROR\",IF(AND(D16=\"\",F16=\"\"),\"\",'Worksheet 8'!$I$45))))","v":""},{"$f":"IF(AND(D16=\"\",F16=\"\"),\"\",'Worksheet 8'!$I$38)","v":""},{"$f":"IF(AND(D16=\"\",F16=\"\"),\"\",'Worksheet 8'!$I$39)","v":""},{"$f":"IF(AND(D16=\"\",F16=\"\"),\"\",'Worksheet 8'!$I$40)","v":""},{"$f":"IF(AND(D16=\"\",F16=\"\"),\"\",'Worksheet 8'!$I$41)","v":""},{"$f":"IF(AND(D16=\"\",F16=\"\"),\"\",'Worksheet 8'!$I$42)","v":""},{"$f":"IF(AND(D16=\"\",F16=\"\"),\"\",'Worksheet 8'!$I$28)","v":""},{"$f":"IF(AND(D16=\"\",F16=\"\"),\"\",'Worksheet 8'!$I$29)","v":""},{"$f":"IF(AND(I16=\"III\",J16=\"\"),\"insert loc. Area\",IF(AND(D16=\"\",F16=\"\"),\"\",'Worksheet 8'!$I$30))","v":""},{"$f":"IF(AND(D16=\"\",F16=\"\"),\"\",'Worksheet 8'!$I$31)","v":""},{"$f":"IF(AND(D16=\"\",F16=\"\"),\"\",'Worksheet 8'!$I$32)","v":""},{"$f":"IF(AND(D16=\"\",F16=\"\"),\"\",'Worksheet 8'!$I$33)","v":""},{"$f":"IF(AND(D16=\"\",F16=\"\"),\"\",'Worksheet 8'!$I$34)","v":""},{"$f":"IF(AND(D16=\"\",F16=\"\"),\"\",'Worksheet 8'!$I$35)","v":""},{"$f":"IF(AND(D16=\"\",F16=\"\"),\"\",'Worksheet 8'!$I$36)","v":""},null,"","","","","","",{"$nulls":34},"simply supported","SS"]
["No.9",{"$nulls":9},0,0,0,{"v":0,"d":"0.00"},{"$nulls":7},{"$f":"IF(AND(D17=\"\",F17=\"\"),\"\",'Worksheet 9'!$I$44)","v":""},{"$f":"IF(AND(I17=\"I\",OR(O17=\"TG\",O17=\"CG\"),OR(Q17=\"no\",Q17=\"\")),\"FAIL\",IF(AE17=\"insert loc. Area\",\"Fail\",IF(AND(Q17=\"yes\",R17=\"\"),\"ERROR\",IF(AND(D17=\"\",F17=\"\"),\"\",'Worksheet 9'!$I$45))))","v":""},{"$f":"IF(AND(D17=\"\",F17=\"\"),\"\",'Worksheet 9'!$I$38)","v":""},{"$f":"IF(AND(D17=\"\",F17=\"\"),\"\",'Worksheet 9'!$I$39)","v":""},{"$f":"IF(AND(D17=\"\",F17=\"\"),\"\",'Worksheet 9'!$I$40)","v":""},{"$f":"IF(AND(D17=\"\",F17=\"\"),\"\",'Worksheet 9'!$I$41)","v":""},{"$f":"IF(AND(D17=\"\",F17=\"\"),\"\",'Worksheet 9'!$I$42)","v":""},{"$f":"IF(AND(D17=\"\",F17=\"\"),\"\",'Worksheet 9'!$I$28)","v":""},{"$f":"IF(AND(D17=\"\",F17=\"\"),\"\",'Worksheet 9'!$I$29)","v":""},{"$f":"IF(AND(I17=\"III\",J17=\"\"),\"insert loc. Area\",IF(AND(D17=\"\",F17=\"\"),\"\",'Worksheet 9'!$I$30))","v":""},{"$f":"IF(AND(D17=\"\",F17=\"\"),\"\",'Worksheet 9'!$I$31)","v":""},{"$f":"IF(AND(D17=\"\",F17=\"\"),\"\",'Worksheet 9'!$I$32)","v":""},{"$f":"IF(AND(D17=\"\",F17=\"\"),\"\",'Worksheet 9'!$I$33)","v":""},{"$f":"IF(AND(D17=\"\",F17=\"\"),\"\",'Worksheet 9'!$I$34)","v":""},{"$f":"IF(AND(D17=\"\",F17=\"\"),\"\",'Worksheet 9'!$I$35)","v":""},{"$f":"IF(AND(D17=\"\",F17=\"\"),\"\",'Worksheet 9'!$I$36)","v":""},null,"","","","","","",null,"6.3.2 Appliances fitted in area IIa"]
["No.10",{"$nulls":9},0,0,0,{"v":0,"d":"0.00"},{"$nulls":7},{"$f":"IF(AND(D18=\"\",F18=\"\"),\"\",'Worksheet 10'!$I$44)","v":""},{"$f":"IF(AND(I18=\"I\",OR(O18=\"TG\",O18=\"CG\"),OR(Q18=\"no\",Q18=\"\")),\"FAIL\",IF(AE18=\"insert loc. Area\",\"Fail\",IF(AND(Q18=\"yes\",R18=\"\"),\"ERROR\",IF(AND(D18=\"\",F18=\"\"),\"\",'Worksheet 10'!$I$45))))","v":""},{"$f":"IF(AND(D18=\"\",F18=\"\"),\"\",'Worksheet 10'!$I$38)","v":""},{"$f":"IF(AND(D18=\"\",F18=\"\"),\"\",'Worksheet 10'!$I$39)","v":""},{"$f":"IF(AND(D18=\"\",F18=\"\"),\"\",'Worksheet 10'!$I$40)","v":""},{"$f":"IF(AND(D18=\"\",F18=\"\"),\"\",'Worksheet 10'!$I$41)","v":""},{"$f":"IF(AND(D18=\"\",F18=\"\"),\"\",'Worksheet 10'!$I$42)","v":""},{"$f":"IF(AND(D18=\"\",F18=\"\"),\"\",'Worksheet 10'!$I$28)","v":""},{"$f":"IF(AND(D18=\"\",F18=\"\"),\"\",'Worksheet 10'!$I$29)","v":""},{"$f":"IF(AND(I18=\"III\",J18=\"\"),\"insert loc. Area\",IF(AND(D18=\"\",F18=\"\"),\"\",'Worksheet 10'!$I$30))","v":""},{"$f":"IF(AND(D18=\"\",F18=\"\"),\"\",'Worksheet 10'!$I$31)","v":""},{"$f":"IF(AND(D18=\"\",F18=\"\"),\"\",'Worksheet 10'!$I$32)","v":""},{"$f":"IF(AND(D18=\"\",F18=\"\"),\"\",'Worksheet 10'!$I$33)","v":""},{"$f":"IF(AND(D18=\"\",F18=\"\"),\"\",'Worksheet 10'!$I$34)","v":""},{"$f":"IF(AND(D18=\"\",F18=\"\"),\"\",'Worksheet 10'!$I$35)","v":""},{"$f":"IF(AND(D18=\"\",F18=\"\"),\"\",'Worksheet 10'!$I$36)","v":""},null,"","","","","","",null,"6.3.2.1 Use of glass",{"$nulls":31},"any","front","F","Any","yes",{"$f":"IF(BI17=\"front\",\"F\",IF(BI17=\"side\",\"S\",IF(BI17=\"any\",\"A\",\"\")))","v":""}]
["No.11",{"$nulls":9},0,0,0,{"v":0,"d":"0.00"},{"$nulls":7},{"$f":"IF(AND(D19=\"\",F19=\"\"),\"\",'Worksheet 11'!$I$44)","v":""},{"$f":"IF(AND(I19=\"I\",OR(O19=\"TG\",O19=\"CG\"),OR(Q19=\"no\",Q19=\"\")),\"FAIL\",IF(AE19=\"insert loc. Area\",\"Fail\",IF(AND(Q19=\"yes\",R19=\"\"),\"ERROR\",IF(AND(D19=\"\",F19=\"\"),\"\",'Worksheet 11'!$I$45))))","v":""},{"$f":"IF(AND(D19=\"\",F19=\"\"),\"\",'Worksheet 11'!$I$38)","v":""},{"$f":"IF(AND(D19=\"\",F19=\"\"),\"\",'Worksheet 11'!$I$39)","v":""},{"$f":"IF(AND(D19=\"\",F19=\"\"),\"\",'Worksheet 11'!$I$40)","v":""},{"$f":"IF(AND(D19=\"\",F19=\"\"),\"\",'Worksheet 11'!$I$41)","v":""},{"$f":"IF(AND(D19=\"\",F19=\"\"),\"\",'Worksheet 11'!$I$42)","v":""},{"$f":"IF(AND(D19=\"\",F19=\"\"),\"\",'Worksheet 11'!$I$28)","v":""},{"$f":"IF(AND(D19=\"\",F19=\"\"),\"\",'Worksheet 11'!$I$29)","v":""},{"$f":"IF(AND(I19=\"III\",J19=\"\"),\"insert loc. Area\",IF(AND(D19=\"\",F19=\"\"),\"\",'Worksheet 11'!$I$30))","v":""},{"$f":"IF(AND(D19=\"\",F19=\"\"),\"\",'Worksheet 11'!$I$31)","v":""},{"$f":"IF(AND(D19=\"\",F19=\"\"),\"\",'Worksheet 11'!$I$32)","v":""},{"$f":"IF(AND(D19=\"\",F19=\"\"),\"\",'Worksheet 11'!$I$33)","v":""},{"$f":"IF(AND(D19=\"\",F19=\"\"),\"\",'Worksheet 11'!$I$34)","v":""},{"$f":"IF(AND(D19=\"\",F19=\"\"),\"\",'Worksheet 11'!$I$35)","v":""},{"$f":"IF(AND(D19=\"\",F19=\"\"),\"\",'Worksheet 11'!$I$36)","v":""},null,"","","","","",{"$f":"IF(AND(I19=\"IIa\",L19=\"sail\",OR(O19=\"TG\",O19=\"CG\"),OR(T19=\"\",T19=\"no\")),\"check if glas is fwd of the mast\",IF(AND(I19=\"I\",L19=\"sail\",OR(T19=\"\",T19=\"no\"),OR(O19=\"TG\",O19=\"CG\")),\"glass shall not be used\",IF(AND(I19=\"I\",OR(T19=\"\",T19=\"no\"),OR(L19=\"any\",L19=\"motor\"),OR(K19=\"A\",K19=\"B\"),OR(O19=\"TG\",O19=\"CG\")),\"glass shall not be used\",\"\")))","v":""},null,"On motor boats, the usage of monolithic and laminated glass is accepted without restriction.\nOn sailing boats, neither monolithic nor laminated glass shall be used forward of the mast or foremast, unless the plate is made of high-impact-resistance glass, or if the appliance is equipped with a deadlight meeting the requirements of 6.3.6. High-impact-resistance glass types are listed in Annex E.",{"$nulls":31},"motor","side","S","M","no"]
["No.12",{"$nulls":9},0,0,0,{"v":0,"d":"0.00"},{"$nulls":7},{"$f":"IF(AND(D20=\"\",F20=\"\"),\"\",'Worksheet 12'!$I$44)","v":""},{"$f":"IF(AND(I20=\"I\",OR(O20=\"TG\",O20=\"CG\"),OR(Q20=\"no\",Q20=\"\")),\"FAIL\",IF(AE20=\"insert loc. Area\",\"Fail\",IF(AND(Q20=\"yes\",R20=\"\"),\"ERROR\",IF(AND(D20=\"\",F20=\"\"),\"\",'Worksheet 12'!$I$45))))","v":""},{"$f":"IF(AND(D20=\"\",F20=\"\"),\"\",'Worksheet 12'!$I$38)","v":""},{"$f":"IF(AND(D20=\"\",F20=\"\"),\"\",'Worksheet 12'!$I$39)","v":""},{"$f":"IF(AND(D20=\"\",F20=\"\"),\"\",'Worksheet 12'!$I$40)","v":""},{"$f":"IF(AND(D20=\"\",F20=\"\"),\"\",'Worksheet 12'!$I$41)","v":""},{"$f":"IF(AND(D20=\"\",F20=\"\"),\"\",'Worksheet 12'!$I$42)","v":""},{"$f":"IF(AND(D20=\"\",F20=\"\"),\"\",'Worksheet 12'!$I$28)","v":""},{"$f":"IF(AND(D20=\"\",F20=\"\"),\"\",'Worksheet 12'!$I$29)","v":""},{"$f":"IF(AND(I20=\"III\",J20=\"\"),\"insert loc. Area\",IF(AND(D20=\"\",F20=\"\"),\"\",'Worksheet 12'!$I$30))","v":""},{"$f":"IF(AND(D20=\"\",F20=\"\"),\"\",'Worksheet 12'!$I$31)","v":""},{"$f":"IF(AND(D20=\"\",F20=\"\"),\"\",'Worksheet 12'!$I$32)","v":""},{"$f":"IF(AND(D20=\"\",F20=\"\"),\"\",'Worksheet 12'!$I$33)","v":""},{"$f":"IF(AND(D20=\"\",F20=\"\"),\"\",'Worksheet 12'!$I$34)","v":""},{"$f":"IF(AND(D20=\"\",F20=\"\"),\"\",'Worksheet 12'!$I$35)","v":""},{"$f":"IF(AND(D20=\"\",F20=\"\"),\"\",'Worksheet 12'!$I$36)","v":""},null,"","","","","",{"$f":"IF(AND(I20=\"IIa\",L20=\"sail\",OR(O20=\"TG\",O20=\"CG\"),OR(T20=\"\",T20=\"no\")),\"check if glas is fwd of the mast\",IF(AND(I20=\"I\",L20=\"sail\",OR(T20=\"\",T20=\"no\"),OR(O20=\"TG\",O20=\"CG\")),\"glass shall not be used\",IF(AND(I20=\"I\",OR(T20=\"\",T20=\"no\"),OR(L20=\"any\",L20=\"motor\"),OR(K20=\"A\",K20=\"B\"),OR(O20=\"TG\",O20=\"CG\")),\"glass shall not be used\",\"\")))","v":""},{"$nulls":33},"sail","any","Any","S",null,{"$f":"IF(BI19=\"any\",\"Any\",IF(BI19=\"motor\",\"M\",IF(BI19=\"sail\",\"S\",\"\")))","v":""}]
["No.13",{"$nulls":9},0,0,0,{"v":0,"d":"0.00"},{"$nulls":7},{"$f":"IF(AND(D21=\"\",F21=\"\"),\"\",'Worksheet 13'!$I$44)","v":""},{"$f":"IF(AND(I21=\"I\",OR(O21=\"TG\",O21=\"CG\"),OR(Q21=\"no\",Q21=\"\")),\"FAIL\",IF(AE21=\"insert loc. Area\",\"Fail\",IF(AND(Q21=\"yes\",R21=\"\"),\"ERROR\",IF(AND(D21=\"\",F21=\"\"),\"\",'Worksheet 13'!$I$45))))","v":""},{"$f":"IF(AND(D21=\"\",F21=\"\"),\"\",'Worksheet 13'!$I$38)","v":""},{"$f":"IF(AND(D21=\"\",F21=\"\"),\"\",'Worksheet 13'!$I$39)","v":""},{"$f":"IF(AND(D21=\"\",F21=\"\"),\"\",'Worksheet 13'!$I$40)","v":""},{"$f":"IF(AND(D21=\"\",F21=\"\"),\"\",'Worksheet 13'!$I$41)","v":""},{"$f":"IF(AND(D21=\"\",F21=\"\"),\"\",'Worksheet 13'!$I$42)","v":""},{"$f":"IF(AND(D21=\"\",F21=\"\"),\"\",'Worksheet 13'!$I$28)","v":""},{"$f":"IF(AND(D21=\"\",F21=\"\"),\"\",'Worksheet 13'!$I$29)","v":""},{"$f":"IF(AND(I21=\"III\",J21=\"\"),\"insert loc. Area\",IF(AND(D21=\"\",F21=\"\"),\"\",'Worksheet 13'!$I$30))","v":""},{"$f":"IF(AND(D21=\"\",F21=\"\"),\"\",'Worksheet 13'!$I$31)","v":""},{"$f":"IF(AND(D21=\"\",F21=\"\"),\"\",'Worksheet 13'!$I$32)","v":""},{"$f":"IF(AND(D21=\"\",F21=\"\"),\"\",'Worksheet 13'!$I$33)","v":""},{"$f":"IF(AND(D21=\"\",F21=\"\"),\"\",'Worksheet 13'!$I$34)","v":""},{"$f":"IF(AND(D21=\"\",F21=\"\"),\"\",'Worksheet 13'!$I$35)","v":""},{"$f":"IF(AND(D21=\"\",F21=\"\"),\"\",'Worksheet 13'!$I$36)","v":""},null,"","","","","",""]
["No.14",{"$nulls":9},0,0,0,{"v":0,"d":"0.00"},{"$nulls":7},{"$f":"IF(AND(D22=\"\",F22=\"\"),\"\",'Worksheet 14'!$I$44)","v":""},{"$f":"IF(AND(I22=\"I\",OR(O22=\"TG\",O22=\"CG\"),OR(Q22=\"no\",Q22=\"\")),\"FAIL\",IF(AE22=\"insert loc. Area\",\"Fail\",IF(AND(Q22=\"yes\",R22=\"\"),\"ERROR\",IF(AND(D22=\"\",F22=\"\"),\"\",'Worksheet 14'!$I$45))))","v":""},{"$f":"IF(AND(D22=\"\",F22=\"\"),\"\",'Worksheet 14'!$I$38)","v":""},{"$f":"IF(AND(D22=\"\",F22=\"\"),\"\",'Worksheet 14'!$I$39)","v":""},{"$f":"IF(AND(D22=\"\",F22=\"\"),\"\",'Worksheet 14'!$I$40)","v":""},{"$f":"IF(AND(D22=\"\",F22=\"\"),\"\",'Worksheet 14'!$I$41)","v":""},{"$f":"IF(AND(D22=\"\",F22=\"\"),\"\",'Worksheet 14'!$I$42)","v":""},{"$f":"IF(AND(D22=\"\",F22=\"\"),\"\",'Worksheet 14'!$I$28)","v":""},{"$f":"IF(AND(D22=\"\",F22=\"\"),\"\",'Worksheet 14'!$I$29)","v":""},{"$f":"IF(AND(I22=\"III\",J22=\"\"),\"insert loc. Area\",IF(AND(D22=\"\",F22=\"\"),\"\",'Worksheet 14'!$I$30))","v":""},{"$f":"IF(AND(D22=\"\",F22=\"\"),\"\",'Worksheet 14'!$I$31)","v":""},{"$f":"IF(AND(D22=\"\",F22=\"\"),\"\",'Worksheet 14'!$I$32)","v":""},{"$f":"IF(AND(D22=\"\",F22=\"\"),\"\",'Worksheet 14'!$I$33)","v":""},{"$f":"IF(AND(D22=\"\",F22=\"\"),\"\",'Worksheet 14'!$I$34)","v":""},{"$f":"IF(AND(D22=\"\",F22=\"\"),\"\",'Worksheet 14'!$I$35)","v":""},{"$f":"IF(AND(D22=\"\",F22=\"\"),\"\",'Worksheet 14'!$I$36)","v":""},null,"","","","","",""]
["No.15",{"$nulls":9},0,0,0,{"v":0,"d":"0.00"},{"$nulls":7},{"$f":"IF(AND(D23=\"\",F23=\"\"),\"\",'Worksheet 15'!$I$44)","v":""},{"$f":"IF(AND(I23=\"I\",OR(O23=\"TG\",O23=\"CG\"),OR(Q23=\"no\",Q23=\"\")),\"FAIL\",IF(AE23=\"insert loc. Area\",\"Fail\",IF(AND(Q23=\"yes\",R23=\"\"),\"ERROR\",IF(AND(D23=\"\",F23=\"\"),\"\",'Worksheet 15'!$I$45))))","v":""},{"$f":"IF(AND(D23=\"\",F23=\"\"),\"\",'Worksheet 15'!$I$38)","v":""},{"$f":"IF(AND(D23=\"\",F23=\"\"),\"\",'Worksheet 15'!$I$39)","v":""},{"$f":"IF(AND(D23=\"\",F23=\"\"),\"\",'Worksheet 15'!$I$40)","v":""},{"$f":"IF(AND(D23=\"\",F23=\"\"),\"\",'Worksheet 15'!$I$41)","v":""},{"$f":"IF(AND(D23=\"\",F23=\"\"),\"\",'Worksheet 15'!$I$42)","v":""},{"$f":"IF(AND(D23=\"\",F23=\"\"),\"\",'Worksheet 15'!$I$28)","v":""},{"$f":"IF(AND(D23=\"\",F23=\"\"),\"\",'Worksheet 15'!$I$29)","v":""},{"$f":"IF(AND(I23=\"III\",J23=\"\"),\"insert loc. Area\",IF(AND(D23=\"\",F23=\"\"),\"\",'Worksheet 15'!$I$30))","v":""},{"$f":"IF(AND(D23=\"\",F23=\"\"),\"\",'Worksheet 15'!$I$31)","v":""},{"$f":"IF(AND(D23=\"\",F23=\"\"),\"\",'Worksheet 15'!$I$32)","v":""},{"$f":"IF(AND(D23=\"\",F23=\"\"),\"\",'Worksheet 15'!$I$33)","v":""},{"$f":"IF(AND(D23=\"\",F23=\"\"),\"\",'Worksheet 15'!$I$34)","v":""},{"$f":"IF(AND(D23=\"\",F23=\"\"),\"\",'Worksheet 15'!$I$35)","v":""},{"$f":"IF(AND(D23=\"\",F23=\"\"),\"\",'Worksheet 15'!$I$36)","v":""},null,"","","","","",""]
[{"$nulls":77},"yes"]
[null,"* In case of red marked cells, please check additional requirements of ISO 12216; e.g. maximum thickness of interlayer, determination of the location in area III or short side b > 300 (600)mm in area I",{"$nulls":75},"no"]
[null,"** please check any warnings on the right side of the worksheet",{"$nulls":75},"no"]

{"sheet":"definitions","index":2,"n_rows":81,"n_cols":19,"rows_kept":81,"merged":[[3,6,5,14],[34,6,35,6],[34,7,35,12],[44,6,44,14],[66,6,66,12]]}
["3.5.2","area I"]
[null,"Motor Craft",{"$nulls":4},"3.5.2"]
[{"$nulls":6},"area I","lower hull sides"]
[{"$nulls":6},"part of the hull sides (and transom) situated above reference waterline (3.9.5), i.e. up the sheerline to its\nintersection with the weather deck (for decked craft), or the upper edge of the hull (for open craft or\npartially decked craft), but only to the following upper boundary:"]
[]
[]
[{"$nulls":7},"- a horizontal line located at the height hS above waterline in the rear half of the waterline (see Figure 1);"]
[null,"Sailing Monohull",{"$nulls":5},"- a sloped line having a height hS at mid waterline, and a height 1,2 hS at the front end of the waterline, with"]
[{"$nulls":7},"- hS = LH/12 for sailing monohulls,"]
[{"$nulls":7},"- hS = LH/17 for motor boats, sailing catamarans and central hull of sailing trimarans."]
[{"$nulls":7},"where hS is limited as per table 1"]
[{"$nulls":6},"NOTE The outer hulls of sailing trimarans are considered to be entirely in Area I."]
[]
[null,"Sailing Multihull",{"$nulls":6},"Table 1 - hS limits of area 1"]
[{"$nulls":7},"Design cat.","hS higher limit","hS lower limit",{"$nulls":6},"Figure 1",1,"area I"]
[{"$nulls":7},"A","no limit","0,5 m",{"$nulls":6},"Key",2,"area IIb"]
[{"$nulls":7},"B","no limit","0,4 m"]
[{"$nulls":7},"C","0,75 m","0,3 m"]
[{"$nulls":7},"D","0,40 m","0,2 m"]
[]
["3.5.3","area II a","3.5.4","area II b",null,null,"3.5.3"]
[null,"Motor Craft",{"$nulls":4},"area II a"]
[{"$nulls":6},"area, other than Area I, where persons are liable to walk or step, such as decks, superstructures, cockpit soles, at"]
[{"$nulls":6},"an inclination of less than 25° to the horizontal in a longitudinal direction, and at an inclination of less than 50° to"]
[{"$nulls":6},"the horizontal in the transversal direction respectively for sailing monohulls, or 25° for multihulls"]
[{"$nulls":6},"3.5.4"]
[{"$nulls":6},"area II b","upper hull side"]
[null,"Sailing Monohull",{"$nulls":4},"areas from the hull sides (and transom) not belonging to area I"]
[{"$nulls":6},"NOTE 1","The following areas may be included if they correspond to the definition:"]
[{"$nulls":7},"- rear faces of transverse girders of multihulls when located above the waterline."]
[]
[{"$nulls":6},"NOTE 2 ","Areas on which people may stand or step, even inadvertently, are part of area II a"]
[{"$nulls":6},"EXAMPLE ","Top of sailboat coachroof on which one may stand or attend to sails."]
[null,"Sailing Multihull"]
[{"$nulls":6},"NOTE 4 ","Superstructure areas on which people cannot normally stand or step, are not part of area II a, but area III"]
[]
[{"$nulls":6},"EXAMPLE ","Top of motorboat wheelhouse is an area on which people cannot normally stand or step."]
[]
[]
[]
[]
[]
["3.5.5","area III",{"$nulls":4},"3.5.5"]
[null,"Motor Craft",{"$nulls":4},"area III","deck and superstructures exposed areas"]
[{"$nulls":6},"areas, other than area I, area II a or area II b, exposed to the direct impact of sea or"]
[{"$nulls":6},"slamming waves coming from front and side"]
[{"$nulls":6},"NOTE (not in the standard anymore, but left as explanation):  On some boat types, Area III may be divided into particular areas. "]
[{"$nulls":6},"For example superstructure front and superstructure sides on motorboats."]
[]
[null,"Sailing Monohull"]
[]
[]
[]
[]
[]
[null,"Sailing Multihull"]
[]
[]
[]
[]
[]
["3.5.6","area IV",{"$nulls":4},"3.5.6"]
[null,"Motor Craft",{"$nulls":4},"area IV","deck and superstructure protected areas"]
[{"$nulls":6},"parts of Area III protected from the direct impact of sea or slamming waves"]
[{"$nulls":6},"coming from front and side, and not located within LH/3 from the bow"]
[{"$nulls":6},"EXAMPLE Cockpits, rear and side faces of superstructures"]
[{"$nulls":6},"NOTE Areas other than the ones given in the example can be included in area IV. The protection against impact from the sea is the responsibility of the manufacturer."]
[null,"Sailing Monohull"]
[]
[]
[]
[]
[]
[null,"Sailing Multihull"]
[]
[]
[]
[]
[]
[]
["NOTE The sketches summarize the different location areas. Where unclear, the definitions in 3.5.2 - 3.5.6 prevail."]

{"sheet":"Tables from ISO 12216","index":3,"n_rows":53,"n_cols":18,"rows_kept":53,"merged":[[20,2,23,2],[20,3,23,3],[20,4,23,4],[20,5,20,8],[21,5,21,8],[22,5,22,6],[35,2,36,2],[35,3,36,4],[35,5,35,7],[37,3,37,4],[38,3,40,4],[39,2,40,2],[39,5,40,5],[39,6,40,6],[39,7,40,7],[41,3,41,4],[42,3,42,4],[43,3,44,4]]}
[]
[]
[]
[null,null,"Material Properties see table F.1 and Tab. 9"]
[null,null,"Table F.1 Average mechanical properties of typical materials [MPa]",null,null,"Tab. 9"]
[null,null,"Material","strength","elasticity","safety"]
[null,null,"PMMA",110,3000,3.5]
[null,null,"PC",90,2400,3.5]
[null,null,"TG",200,72600,4]
[null,null,"CG",300,72600,4]
[null,null,"AG",40,72600,4]
[null,null,"AMPW",50,7000,2]
[null,null,"GRP M30",140,7500,2]
[null,null,"GRP M35",175,10000,2]
[null,null,"AL 5083",280,70000,2]
[null,null,"MS",400,200000,2]
[null,null,"AISI 316 L",510,200000,2]
[]
[]
[null,null,"Table 9 — Safety factor and minimum thickness of monolithic plates"]
[null,null,"Material","Acronym","Safety factor\n γ ","Minimum thickness of monolithic plates, tm"]
[{"$nulls":5},"Design categories "]
[{"$nulls":5},"Any",null,"A & B","C & D"]
[{"$nulls":5},"Area Ia","Area II","Area III & IV","Area III & IV"]
[null,null,"Poly(methyl)methacrylate","PMMA",3.5,"6+0,1(LH-4)",6,5,4]
[null,null,"Polycarbonate","PC",3.5,"6+0,1(LH-4)",6,5,4]
[null,null,"Monolithic tempered glass ","TG",4,"5+0,1(LH-4)b",4,4,3]
[null,null,"Laminated glass ","LG",4,"5+0,1(LH-4)b",4,4,3]
[null,null,"All mahogany plywood ","AMPW",2,"8+0,1(LH-4)",6,5,4]
[null,null,"GRP mat 30 % glass ","GRP M30",2,"4+0,1(LH-4)",3,3,2]
[null,null,"GRP mat/roving 35 % glass ","GRP M35",2,"4+0,1(LH-4)",3,3,2]
[null,null,"Aluminium alloy 5083-H111 ","AL 5038",2,"3+0,05 (LH-4)",3,3,2]
[null,null,"Mild steel ","MS",2,"2,5+0,025 (LH-4)",2.5,2.5,2]
[]
[null,null,"Table 3 — Minimum degree of watertightness"]
[null,null,"Watercraft type","Appliance and/or\nlocation area",null,"Design category"]
[{"$nulls":5},"A / B","C","D"]
[null,null,"Any","Area I: lower hull side",null,2,2,2]
[null,null,"Sailing Monohull","Area II (a+b)",null,2,2,3]
[null,null,"Non-sailing and sailing multihull",null,null,2,3,4]
[]
[null,null,"Any","Sliding companionway hatch in areas IIa",null,3,3,4]
[null,null,"Any","Area III: deck and superstructure, exposed",null,3,3,4]
[null,null,"Sailing Monohull","Area III: deck and superstructure, protected areas",null,3,3,4]
[null,null,"Non-sailing and sailing multihull",null,null,3,4,4]
[]
[null,null,"Table 8 — Basic design pressure p"]
[null,null,"Application\nlocation area","I","IIb","IIb","IIb","IIa","III","III","III","III","III","III","III","III","IV","IV"]
[null,null,"Boat type","Any","Any","Any","Any","Any","Sail","Sail","Motor","Motor","Motor","Motor","Motor","Motor","Sail","Motor"]
[null,null,"Design category","Any","A","B","C,D","Any","A,B","C,D","A","B","A","B","C","D","Any","Any"]
[null,null,"Particular\n(front, side, any)","Any","Any","Any","Any","Any","Any","Any","Front","Front","side","Side","Any","Any","Any","Any"]
[null,null,"Pressure, p, kPa",70,70,50,28,28,18,12,12,9,9,6,6,6,12,6]
[null,null,"To simplify the figures, the pressure in this table is expressed in kilopascals, but pascals shall be used in 7.2.1"]

{"sheet":"Worksheet 1","index":4,"n_rows":45,"n_cols":31,"rows_kept":45,"merged":[[0,0,0,9],[0,11,0,12],[1,0,1,9],[2,0,2,9],[4,0,4,9],[6,0,6,5],[17,13,17,14],[19,13,19,14],[21,12,21,14],[22,15,26,18],[27,6,28,6],[27,7,28,7],[27,15,27,21],[29,15,32,15],[29,16,32,16],[29,17,32,17],[29,18,29,21],[30,18,30,21],[31,18,31,19],[32,11,32,13],[34,13,34,14],[36,13,36,14],[38,13,38,14],[39,13,39,14],[41,13,41,14]]}
[{"$nulls":11},"Comments"]
["ISO 12216:2020 - Small craft - Windows, portlights, hatches, deadlights and doors",{"$nulls":11},"Derived values"]
["WORKSHEET No. 1 data entry",{"$nulls":11},"Input values"]
[]
[{"$f":"CONCATENATE(coverSheet!B5,\"   \",coverSheet!B12,\"    \",Summary!B9)","v":"       "}]
[]
["Parameter",{"$nulls":5},"Symbol","Unit","Value","Ref.",{"$nulls":5},"Material Properties see table F.1 and Tab. 5",{"$nulls":11},"List"]
["Form of plate (Rectangular / Circle)",{"$nulls":5},"R / C",null,{"$f":"Summary!C9","v":0},"Annex C",{"$nulls":5},"Table F.1 mechanical properties [MPa]",null,null,"Tab. 5",{"$nulls":8},"Lists"]
["Long side",{"$nulls":5},"a","mm",{"$f":"Summary!D9","v":0},"7.3, Annex C",{"$nulls":5},"Material","strength","elasticity","safety",{"$nulls":7},"rectangular","R","I","A",{"$f":"IF(I8=\"rectangular\",\"R\",IF(I8=\"circle\",\"C\",\"\"))","v":""}]
["Unsupported short side",{"$nulls":5},"b","mm",{"$f":"Summary!E9","v":0},"7.3, Annex C",{"$nulls":5},"PMMA",110,3000,3.5,{"$nulls":7},"circle","C","IIa","B"]
["Diameter",{"$nulls":5},"d","mm",{"$f":"Summary!F9","v":0},"7.3, Annex C",{"$nulls":5},"PC",90,2400,3.5,{"$nulls":9},"IIb","C"]
["Curve height",{"$nulls":5},"c","mm",{"$f":"Summary!G9","v":0},"7.6",{"$nulls":5},"TG",200,72600,4,{"$nulls":9},"III","D"]
["Support SemiFixed / Simply Supported",{"$nulls":5},"SF / SS",null,{"$f":"Summary!H9","v":0},"3.18",{"$nulls":5},"CG",300,72600,4,{"$nulls":7},"semi-fixed","SF","IV",null,{"$f":"IF(I13=\"semi-fixed\",\"SF\",IF(I13=\"\",\"\",\"SS\"))","v":"SS"}]
["Location type",{"$nulls":5},"I/IIA/IIB/III/IV",null,{"$f":"Summary!I9","v":0},"3.17; Annex A",{"$nulls":5},"AG",40,72600,4,{"$nulls":7},"simply supported","SS"]
["Location area (only loc. III)",{"$nulls":5},"F / S / Any",null,{"$f":"Summary!J9","v":0},"3.17.4",{"$nulls":5},"AMPW",50,7000,2]
["Design Category",{"$nulls":5},"A / B / C / D",null,{"$f":"Summary!K9","v":0},"3.12",{"$nulls":5},"GRP M30",140,7500,2,{"$nulls":6},"any","front","F","Any","yes",{"$f":"IF(I15=\"front\",\"F\",IF(I15=\"side\",\"S\",IF(I15=\"any\",\"A\",\"\")))","v":""}]
["Craft Type Any/Motor/Sail",{"$nulls":5},"Any / M / S",null,{"$f":"Summary!L9","v":0},{"$nulls":6},"GRP M35",175,10000,2,{"$nulls":6},"motor","side","S","M","no"]
["Length of hull as in ISO 8666",{"$nulls":5},"LH","m",{"$f":"Summary!N9","v":0},"3.16",{"$nulls":5},"AL 5038",280,70000,2,{"$nulls":6},"sail","any","Any","S",null,{"$f":"IF(I17=\"any\",\"Any\",IF(I17=\"motor\",\"M\",IF(I17=\"sail\",\"S\",\"\")))","v":""}]
["Material data",{"$nulls":7},{"$f":"Summary!O9","v":0},"Table F.1 & 5",{"$nulls":5},"MS",400,200000,2]
[null,"  Ultimate flexural strength",{"$nulls":4},"σU","MPa",{"$f":"'main Side windows 1'!D18","v":{"$error":"#N/A"}},"Table F.1 & 5",{"$nulls":5},"AISI 316 L",510,200000,2]
[null,"  Modulus of elasticity",{"$nulls":4},"E","MPa",{"$f":"'main Side windows 1'!D19","v":{"$error":"#N/A"}},"Table F.1 & 5"]
[null,"  Safety factor",{"$nulls":4},"gamma",". / .",{"$f":"'main Side windows 1'!D20","v":{"$error":"#N/A"}},"Table F.1 & 5",{"$nulls":15},"yes"]
["Is actual plate a sandwich?",{"$nulls":5},"yes / no",null,{"$f":"Summary!Q9","v":0},"7.9",{"$nulls":5},{"$f":"IF(I23=\"YES\",\"The difference in thickness between any two glass plies must be less than or equal to 2 mm and the thickness of the plastic interlayer must be less than, or equal to 0,76 mm for these conditions !\",\"\")","v":""},{"$nulls":9},"no"]
[null,"If yes, enter number of layers",{"$nulls":5},". / .",{"$f":"Summary!R9","v":0},"7.9"]
["Actual plate thickness (in case of sandwich the sum of all layers)",{"$nulls":6},"mm",{"$f":"Summary!U9","v":0}]
[]
["Results for non-stiffened plates"]
["Press reduction factor",{"$nulls":5},"Ψ",". / .",{"$f":"'main Side windows 1'!D23","v":false},"7.5"]
["              within limits 0,33 and 1,0",{"$nulls":7},{"$f":"'main Side windows 1'!D24","v":1},"7.5",{"$nulls":5},"Table 5 — Safety factor and minimum thickness of monolithic plates"]
["Basic design press",{"$nulls":5},"p","kPa",{"$f":"'main Side windows 1'!D25","v":1},"7.4",{"$nulls":5},"Material","Acronym","Safety factor\n γ ","Minimum thickness of monolithic plates, tm"]
["Allowable flexural stress",{"$nulls":5},"σa","MPa",{"$f":"'main Side windows 1'!D26","v":{"$error":"#N/A"}},"7.8",{"$nulls":8},"Design categories "]
["Curvature coefficient",{"$nulls":5},"kC",". / .",{"$f":"'main Side windows 1'!D27","v":{"$error":"#DIV/0!"}},"7.6",{"$nulls":8},"Any",null,"A & B","C & D"]
["Ratio a/b (valid ≤ 5)",{"$nulls":6},". / .",{"$f":"'main Side windows 1'!D28","v":{"$error":"#DIV/0!"}},"7.3, Annex G.2",{"$nulls":8},"Area Ia","Area II","Area III & IV","Area III & IV"]
["Ratio a/b corrected",{"$nulls":6},". / .",{"$f":"'main Side windows 1'!D29","v":{"$error":"#DIV/0!"}},"7.3, Annex G.2",{"$nulls":5},"Poly(methyl)methacrylate","PMMA",3.5,"6+0,1(LH-4)",6,5,4]
["Plate aspect ratio coeff stress",{"$nulls":5},"kr",". / .",{"$f":"'main Side windows 1'!D30","v":"FALSCH"},"7.3, Annex G.2",{"$nulls":5},"Polycarbonate","PC",3.5,"6+0,1(LH-4)",6,5,4]
["Pate aspect ratio coeff deflection",{"$nulls":5},"kf",". / .",{"$f":"'main Side windows 1'!D31","v":false},"7.3, Annex G.2",{"$nulls":5},"Monolithic tempered glass ","TG",4,"5+0,1(LH-4)b",4,4,3]
[{"$nulls":15},"Laminated glass ","LG",4,"5+0,1(LH-4)b",4,4,3]
["Thickness (Stress)",{"$nulls":5},"tr","mm",{"$f":"'main Side windows 1'!D33","v":{"$error":"#DIV/0!"}},"7.1.1",{"$nulls":5},"All mahogany plywood ","AMPW",2,"8+0,1(LH-4)",6,5,4]
["Thickness (Deflection)",{"$nulls":5},"tf","mm",{"$f":"'main Side windows 1'!D34","v":{"$error":"#DIV/0!"}},"7.1.2",{"$nulls":5},"GRP mat 30 % glass ","GRP M30",2,"4+0,1(LH-4)",3,3,2]
["Thickness",{"$nulls":6},"mm",{"$f":"'main Side windows 1'!D35","v":{"$error":"#DIV/0!"}},{"$nulls":6},"GRP mat/roving 35 % glass ","GRP M35",2,"4+0,1(LH-4)",3,3,2]
["Thickness minimu, techn. ",{"$nulls":5},"tm","mm",{"$f":"'main Side windows 1'!D36","v":{"$error":"#DIV/0!"}},"7.8",{"$nulls":5},"Aluminium alloy 5083-H111 ","AL 5038",2,"3+0,05 (LH-4)",3,3,2]
["Thickness minimum, Tab 5",{"$nulls":6},"mm",{"$f":"'main Side windows 1'!D37","v":{"v":0,"d":"0.0"}},"Table 5",{"$nulls":5},"Mild steel ","MS",2,"2,5+0,025 (LH-4)",2.5,2.5,2]
[]
["Required plate thickness",{"$nulls":6},"mm",{"$f":"'main Side windows 1'!I31","v":{"$error":"#DIV/0!"}}]
["Requirements fullfilled?",{"$nulls":7},{"$f":"IF(L13=\"short side in area I max 300mm\",\"FAIL\",IF(I25>=I44,\"PASS\",\"FAIL\"))","v":{"$error":"#DIV/0!"}}]

{"sheet":"main Side windows 1","index":5,"n_rows":43,"n_cols":24,"rows_kept":43,"hidden":true,"merged":[[0,0,0,5],[1,0,1,5],[25,11,28,18],[26,6,26,7]]}
[{"$nulls":6},"manufacturer"]
[{"$nulls":6},"model name"]
["Eingabe","Version 1.2.2 / 15-03-2006 rev 060512/070507/dew 090918",{"$nulls":4},"ISO/FDIS 12216:2002(E)"]
["Parameter Input","SSign","Item/Unit",{"$nulls":18},"Lists"]
["form of plate Rectangular/Circle",null,"R/C",{"$f":"'Worksheet 1'!AE9","v":""},{"$f":"IF(D5=\"\",\"Input R oder C\",\"\")","v":"Input R oder C"},null,"Material Properties see table F.1 and Tab. 5",{"$nulls":14},"R","I","A"]
["long side","a","mm",{"$f":"'Worksheet 1'!I9","v":0},{"$f":"IF(AND(D5=\"R\",D6=\"\"),\"Input a requested\",IF(AND(D5=\"C\",D6=\"\"),\"Input d requested\",\"\"))","v":""},null,"Table F.1 mechanical properties [Mpa]",null,null,"Tab. 5",{"$nulls":11},"C","IIa","B"]
["unsupported short side","b","mm",{"$f":"'Worksheet 1'!I10","v":0},{"$f":"IF(AND(D5=\"R\",D7=\"\"),\"Input b requested\",IF(AND(D5=\"C\",D7=\"\"),\"Input d requested\",\"\"))","v":""},null,"Material","strength","elasticity","safety",{"$nulls":12},"IIb","C"]
["diameter","d","mm",{"$f":"'Worksheet 1'!I11","v":0},{"$f":"IF(AND(D5=\"C\",D8=\"\"),\"Input d requested\",\"\")","v":""},null,"PMMA",110,3000,3.5,{"$nulls":3},"AG",40,72600,4,{"$nulls":5},"III","D"]
["curve height","c","mm",{"$f":"'Worksheet 1'!I12","v":0},"optional",null,"PC",90,2400,3.5,{"$nulls":3},"AISI 316 L",510,200000,2,{"$nulls":4},"SF","IV"]
["support SemiFixed/Simple Supp.",null,"SF/SS",{"$f":"'Worksheet 1'!AE13","v":"SS"},{"$f":"IF(D10=\"\",\"Input SF or SS\",\"\")","v":""},null,"TG",200,72600,4,null,null,"6.1","AL 5038",280,70000,2,{"$nulls":4},"SS"]
["Location type",null,"I/IIA/IIB/III/IV",{"$f":"'Worksheet 1'!I14","v":{"v":0,"d":"0.00"}},{"$f":"IF(D11=\"\",\"Input I / IIa,b / III / IV\",\"\")","v":""},null,"CG",300,72600,4,null,null,"3.17.1-4","AMPW",50,7000,2]
["Location area (only loc. III)",null,"F/S/A",{"$f":"'Worksheet 1'!AE16","v":""},{"$f":"IF(D12=\"F\",\"\",IF(D12=\"S\",\"\",IF(D12=\"A\",\"\",IF(D11=\"III\",\"Input F / S / A\",\"\"))))","v":""},null,"AG",40,72600,4,{"$nulls":3},"CG",300,72600,4,{"$nulls":4},"F","Any","yes"]
["Design Category",null,"A/B/C/D",{"$f":"IF('Worksheet 1'!I16=\"\",\"\",'Worksheet 1'!I16)","v":{"v":0,"d":"0.00"}},{"$f":"IF(D13=\"\",\"Input A / B / C / D\",\"\")","v":""},null,"AMPW",50,7000,2,{"$nulls":3},"GRP M30",140,7500,2,{"$nulls":4},"S","M","no"]
["Craft Type Any/Motor/Sail",null,"Any/M/S",{"$f":"'Worksheet 1'!AE18","v":""},{"$f":"IF(D14=\"\",\"Input Any / M / S\",\"\")","v":"Input Any / M / S"},null,"GRP M30",140,7500,2,{"$nulls":3},"GRP M35",175,10000,2,{"$nulls":4},"A","S"]
["optional: craft length of hull",null,"m",{"$f":"'Worksheet 1'!I18","v":{"v":0,"d":"0.00"}},"default, change if smaller",null,"GRP M35",175,10000,2,{"$nulls":3},"MS",400,200000,2]
[{"$nulls":6},"AL 5038",280,70000,2,{"$nulls":3},"PC",90,2400,3.5]
["Material",null,"see Tab. F.1",{"$f":"'Worksheet 1'!I19","v":{"v":0,"d":"0.00"}},{"$f":"IF(D17=\"\",\"manual input requ\",\"\")","v":""},null,"MS",400,200000,2,{"$nulls":3},"PMMA",110,3000,3.5]
["  ultimate flexural strength","Sigma u",null,{"$f":"LOOKUP(D17,N8:N18,O8:O18)","v":{"$error":"#N/A"}},"falls nicht in F.1 ",null,"AISI 316 L",510,200000,2,{"$nulls":3},"TG",200,72600,4]
["  modulus of elasticity","E",null,{"$f":"LOOKUP(D17,N8:N18,P8:P18)","v":{"$error":"#N/A"}},"Werte manuell"]
["  safety factor","gamma",null,{"$f":"LOOKUP(D17,N8:N18,Q8:Q18)","v":{"$error":"#N/A"}},"eintragen"]
[]
["Results for non-stiffened plates"]
["press reduction factor",null,null,{"$f":"IF(D5=\"R\",1.102-0.0004*D7,IF(D5=\"C\",1.102-0.0004*D8))","v":false},"(7.5)"]
["              within limits 0,33 and 1,0","psi",null,{"$f":"IF(D23<0.33,0.33,IF(D23>1,1,D23))","v":{"v":1,"d":"1.000"}},"(7.5)"]
["basic design press","p","KPa",{"$f":"'basic design pressure 1'!G43","v":{"v":1,"d":"1.00"}},"(7.4)",null,"see work sheet \"basic design press\""]
["allowable flexural stress","Sigma a","MPa",{"$f":"D18/D20","v":{"$error":"#N/A"}},"(7.8)",null,"is actual plate a sandwich?",null,{"$f":"'Worksheet 1'!I23","v":0},null,null,{"$f":"IF(I26=\"YES\",\"the difference in thickness between any two glass plies must be less than or equal to 2 mm and the thickness of the plastic interlayer must be less than, or equal to 0,76 mm for these conditions !\",\"\")","v":""}]
["curvature coefficient","kc",null,{"$f":"IF(D5=\"C\",1-(D9/D8),1-(D9/D7))","v":{"$error":"#DIV/0!"}},"(7.6)",null,{"$f":"IF(I26=\"yes\", \"number of layers?\",\"\")","v":""},null,{"$f":"IF('Worksheet 1'!I24=\"\",\"\",'Worksheet 1'!I24)","v":0}]
["              a/b real  (valid ≤ 5)",null,null,{"$f":"IF(D5=\"C\",1,D6/D7)","v":{"$error":"#DIV/0!"}},"(7.3) Annex G.2"]
["              a/b corrected",null,null,{"$f":"IF(D28>5,5,D28)","v":{"$error":"#DIV/0!"}},"(7.3) Annex G.2"]
["plate aspect ratio coeff stress","kr",null,{"$f":"IF(D5=\"R\",IF(D10=\"SF\",(0.62165*D29^2-0.6473*D29+0.26481)/(D29^2-1.173*D29+0.97671),IF(D10=\"SS\",(0.69952*D29^2+0.02662*D29-0.0735)/(D29^2-0.7185*D29+1.98925),\"Fehler\")),IF(D5=\"C\",IF(D10=\"SF\",0.248,0.309),\"FALSCH\"))","v":"FALSCH"},"(7.3) Annex G.2",null,"actual plate Thickness",null,{"$f":"'Worksheet 1'!I25","v":0},"mm",null,{"$f":"IF(I26=\"yes\", \"=sum of all plies\",\"\")","v":""}]
["pate aspect ratio coeff deflection","kf",null,{"$f":"IF(D5=\"R\",IF(D10=\"SF\",(0.08052*D29^2-0.0272*D29-0.0019)/(D29^2-0.9275*D29+1.70018),IF(D10=\"SS\",(0.12915*D29^2+0.00868*D29-0.0293)/(D29^2-0.887*D29+2.3372),\"Fehler\")),IF(D5=\"C\",IF(D10=\"SF\",0.027,0.043)))","v":false},"(7.3) Annex G.2",null,"required plate thickness",null,{"$f":"IF(AND(I26=\"Yes\",I27=\"\"),\"please enter number of layers\",IF(AND(I26=\"Yes\",I27>2),1.5*MAX(D35:D37),IF(AND(I26=\"Yes\",I27=2),1.2*MAX(D35:D37),IF(I36=\"Yes\",MAX(D36:D37),MAX(D35:D37)))))","v":{"$error":"#DIV/0!"}}]
[{"$nulls":6},"requirements fulfilled?",null,{"$f":"IF(I30=\"\",\"\",IF(I30>=I31,\"PASS\",\"FAIL\"))","v":{"$error":"#DIV/0!"}}]
["Thickness (Stress)","tr","mm",{"$f":"IF(D5=\"C\",D8*D27*SQRT(D30*D24*D25/D26/1000),D7*D27*SQRT(D30*D24*D25/D26/1000))","v":{"$error":"#DIV/0!"}},"(7.1.1)"]
["Thickness (Deflection)","tf","mm",{"$f":"0.45*(D33+D7*D27*POWER((D31*D24*D25/0.02/D19/1000),0.33333))","v":{"$error":"#DIV/0!"}},"(7.1.2)"]
["Thickness",null,null,{"$f":"ROUND(MAX(D33:D34),2)","v":{"$error":"#DIV/0!"}},"(7.1.7)",{"$nulls":3},"Minimum tech used???"]
["Thickness minimu, techn. ",null,"mm",{"$f":"D35-0.5","v":{"$error":"#DIV/0!"}},null,null," = Minimum, absolute",null,{"$f":"Summary!P9","v":0}]
["Thickness minimum, Tab 5","tm","mm",{"$f":"'basic design pressure 1'!J48","v":{"v":0,"d":"0.0"}},"(Tab. 5)",null,"(only PMMA, PC, TG, LG)"]
[]
["Escape Hatch possible ?"]
["Required ISO 9094-1, 2"]
["Circular: inner Diam > 450 mm",null,null,{"$f":"IF(D5=\"C\",IF(D8>450,\"pass\",\"fail\"),\"n.a.\")","v":"n.a."}]
["Rectang: inner Diam > 380 mm",null,null,{"$f":"IF(D5=\"R\",IF(MAX(D6:D7)>380,\"pass\",\"fail\"),\"n.a.\")","v":"n.a."}]
["              Area > 180000 mm²",null,null,{"$f":"IF(D5=\"R\",IF(D6*D7>180000,\"pass\",\"fail\"),\"n.a.\")","v":"n.a."}]

{"sheet":"basic design pressure 1","index":6,"n_rows":193,"n_cols":10,"rows_kept":193,"hidden":true}
["Basic design pressure",null,null,"(7.4 Table 4)"]
[]
["location",null,{"$f":"'main Side windows 1'!D11","v":0}]
["particular",null,{"$f":"IF(AND(C5=\"C\",C6=\"M\",C3=\"III\"),\"A\",'main Side windows 1'!D12)","v":""},null,"Remark: f=front, s=side, a=any"]
["design cat",null,{"$f":"'main Side windows 1'!D13","v":0}]
["craft type",null,{"$f":"'main Side windows 1'!D14","v":""},{"$f":"IF(C6=\"Any\",\"S\",C6)","v":""},"Remark: if craft type = Any, set craft type = S"]
[]
[]
["Tabelle 4",null,"location","craft type","design cat","particular","pressure"]
[null,null,"I","Any","Any","Any",70]
[null,null,"IIB","Any","A","Any",70]
[null,null,"IIB","Any","B","Any",50]
[null,null,"IIB","Any","C","Any",28]
[null,null,"IIB","Any","D","Any",28]
[null,null,"IIA","Any","Any","Any",28]
[null,null,"III","S","A","Any",18]
[null,null,"III","S","B","Any",18]
[null,null,"III","S","C","Any",12]
[null,null,"III","S","D","Any",12]
[null,null,"III","M","A","Front",12]
[null,null,"III","M","A","Any",12,null,null,"Korrektur, Zeile eingefügt um Fehler bei eingabe III, M, any zu beheben"]
[null,null,"III","M","B","Front",9]
[null,null,"III","M","B","Any",9,null,null,"Korrektur, Zeile eingefügt um Fehler bei eingabe III, M, any zu beheben"]
[null,null,"III","M","D","Front",6,null,null,"Korrektur, Zeile eingefügt um Fehler bei eingabe III, M, Front, D zu beheben"]
[null,null,"III","M","A","Side",9]
[null,null,"III","M","B","Side",6]
[null,null,"III","M","C","Any",6]
[null,null,"III","M","D","Any",6]
[null,null,"IV","S","Any","Any",12]
[null,null,"IV","M","Any","Any",6]
[]
["Ergebnis"]
[null,"location = I",{"$nulls":4},{"$f":"IF(C3=\"I\",G10,0)","v":0}]
[null,"location = IIB",{"$nulls":4},{"$f":"IF(C3=\"IIB\",VLOOKUP(C5,E11:G15,3),0)","v":0}]
[null,"location = IIA",{"$nulls":4},{"$f":"IF(C3=\"IIA\",VLOOKUP(C3,E11:G15,3),0)","v":0}]
[null,"location = III","craft = S",{"$nulls":3},{"$f":"IF(AND(C3=\"III\",D6=\"S\"),VLOOKUP(C5,E16:G19,3),0)","v":0}]
[null,"location = III","craft = M","particular = front",null,null,{"$f":"IF(AND(C3=\"III\",D6=\"M\",C4=\"F\"),VLOOKUP(C5,E20:G24,3),0)","v":0}]
[null,"location = III","craft = M","particular = any",null,null,{"$f":"IF(AND(OR(C5=\"A\",C5=\"B\"),C3=\"III\",D6=\"M\",C4=\"A\"),VLOOKUP(C5,E20:G24,3),0)","v":0}]
[null,"location = III","craft = M","particular = side",null,null,{"$f":"IF(AND(C3=\"III\",C6=\"M\",C4=\"S\"),IF(C5=\"A\",9,IF(C5=\"B\",6,0)))","v":false}]
[null,"location = III","craft = M",{"$nulls":3},{"$f":"IF(C5=\"A\",0,IF(C5=\"B\",0,IF(AND(C3=\"III\",C6=\"M\"),VLOOKUP(C5,E27:G28,3))))","v":false}]
[null,"location = IV",{"$nulls":4},{"$f":"IF(C3=\"IV\",VLOOKUP(D6,D29:G30,4,0),1)","v":1}]
[]
["pressure",{"$nulls":5},{"$f":"MAX(G33:G41)","v":1}]
[]
[]
["minimum thickness"]
[]
[null,"Area",{"$f":"IF(OR('main Side windows 1'!D11=\"IIA\",'main Side windows 1'!D11=\"IIB\"),\"II\",'main Side windows 1'!D11)","v":0},{"$nulls":4},"minimum thickness",null,{"$f":"MAX(J50:J190)","v":0}]
[]
[null,null,"PMMA","A","I",{"$f":" IF('main Side windows 1'!$D$15>0,6 + 0.1*('main Side windows 1'!$D$15-4),\"\")","v":""},{"$nulls":3},{"$f":"IF('main Side windows 1'!$D$17=\"PMMA\",(IF('main Side windows 1'!$D$13=\"A\",VLOOKUP($C$48,$E$50:$F$53,2,-1),0)),0)","v":0}]
["Table 5",{"$nulls":3},"II",6]
[{"$nulls":4},"III",5]
[{"$nulls":4},"IV",5]
[null,null,"PMMA","B","I",{"$f":" IF('main Side windows 1'!$D$15>0,6 + 0.1*('main Side windows 1'!$D$15-4),\"\")","v":""},{"$nulls":3},{"$f":"IF('main Side windows 1'!$D$17=\"PMMA\",(IF('main Side windows 1'!$D$13=\"B\",VLOOKUP($C$48,$E$54:$F$57,2,-1),0)),0)","v":0}]
[{"$nulls":4},"II",6]
[{"$nulls":4},"III",5]
[{"$nulls":4},"IV",5]
[null,null,"PMMA","C","I",{"$f":" IF('main Side windows 1'!$D$15>0,6 + 0.1*('main Side windows 1'!$D$15-4),\"\")","v":""},{"$nulls":3},{"$f":"IF('main Side windows 1'!$D$17=\"PMMA\",(IF('main Side windows 1'!$D$13=\"C\",VLOOKUP($C$48,$E$58:$F$61,2,-1),0)),0)","v":0}]
[{"$nulls":4},"II",6]
[{"$nulls":4},"III",4]
[{"$nulls":4},"IV",4]
[null,null,"PMMA","D","I",{"$f":" IF('main Side windows 1'!$D$15>0,6 + 0.1*('main Side windows 1'!$D$15-4),\"\")","v":""},{"$nulls":3},{"$f":"IF('main Side windows 1'!$D$17=\"PMMA\",(IF('main Side windows 1'!$D$13=\"D\",VLOOKUP($C$48,E62:F65,2,-1),0)),0)","v":0}]
[{"$nulls":4},"II",6]
[{"$nulls":4},"III",4]
[{"$nulls":4},"IV",4]
[null,null,"PC","A","I",{"$f":" IF('main Side windows 1'!$D$15>0,6 + 0.1*('main Side windows 1'!$D$15-4),\"\")","v":""},{"$nulls":3},{"$f":"IF('main Side windows 1'!$D$17=\"PC\",(IF('main Side windows 1'!$D$13=\"A\",VLOOKUP($C$48,E66:F69,2,-1),0)),0)","v":0}]
[{"$nulls":4},"II",6]
[{"$nulls":4},"III",5]
[{"$nulls":4},"IV",5]
[null,null,"PC","B","I",{"$f":" IF('main Side windows 1'!$D$15>0,6 + 0.1*('main Side windows 1'!$D$15-4),\"\")","v":""},{"$nulls":3},{"$f":"IF('main Side windows 1'!$D$17=\"PC\",(IF('main Side windows 1'!$D$13=\"B\",VLOOKUP($C$48,E70:F73,2,-1),0)),0)","v":0}]
[{"$nulls":4},"II",6]
[{"$nulls":4},"III",5]
[{"$nulls":4},"IV",5]
[null,null,"PC","C","I",{"$f":" IF('main Side windows 1'!$D$15>0,6 + 0.1*('main Side windows 1'!$D$15-4),\"\")","v":""},{"$nulls":3},{"$f":"IF('main Side windows 1'!$D$17=\"PC\",(IF('main Side windows 1'!$D$13=\"C\",VLOOKUP($C$48,E74:F77,2,-1),0)),0)","v":0}]
[{"$nulls":4},"II",6]
[{"$nulls":4},"III",4]
[{"$nulls":4},"IV",4]
[null,null,"PC","D","I",{"$f":" IF('main Side windows 1'!$D$15>0,6 + 0.1*('main Side windows 1'!$D$15-4),\"\")","v":""},{"$nulls":3},{"$f":"IF('main Side windows 1'!$D$17=\"PC\",(IF('main Side windows 1'!$D$13=\"D\",VLOOKUP($C$48,E78:F81,2,-1),0)),0)","v":0}]
[{"$nulls":4},"II",6]
[{"$nulls":4},"III",4]
[{"$nulls":4},"IV",4]
[null,null,"TG","A","I",{"$f":" IF('main Side windows 1'!$D$15>0,5+ 0.1*('main Side windows 1'!$D$15-4),\"\")","v":""},{"$nulls":3},{"$f":"IF('main Side windows 1'!$D$17=\"TG\",(IF('main Side windows 1'!$D$13=\"A\",VLOOKUP($C$48,E82:F85,2,-1),0)),0)","v":0}]
[{"$nulls":4},"II",4]
[{"$nulls":4},"III",4]
[{"$nulls":4},"IV",4]
[null,null,"TG","B","I",{"$f":" IF('main Side windows 1'!$D$15>0,5+ 0.1*('main Side windows 1'!$D$15-4),\"\")","v":""},{"$nulls":3},{"$f":"IF('main Side windows 1'!$D$17=\"TG\",(IF('main Side windows 1'!$D$13=\"B\",VLOOKUP($C$48,E86:F89,2,-1),0)),0)","v":0}]
[{"$nulls":4},"II",4]
[{"$nulls":4},"III",4]
[{"$nulls":4},"IV",4]
[null,null,"TG","C","I",{"$f":" IF('main Side windows 1'!$D$15>0,5+ 0.1*('main Side windows 1'!$D$15-4),\"\")","v":""},{"$nulls":3},{"$f":"IF('main Side windows 1'!$D$17=\"TG\",(IF('main Side windows 1'!$D$13=\"C\",VLOOKUP($C$48,E90:F93,2,-1),0)),0)","v":0}]
[{"$nulls":4},"II",4]
[{"$nulls":4},"III",3]
[{"$nulls":4},"IV",3]
[null,null,"TG","D","I",{"$f":" IF('main Side windows 1'!$D$15>0,5+ 0.1*('main Side windows 1'!$D$15-4),\"\")","v":""},{"$nulls":3},{"$f":"IF('main Side windows 1'!$D$17=\"TG\",(IF('main Side windows 1'!$D$13=\"D\",VLOOKUP($C$48,E94:F97,2,-1),0)),0)","v":0}]
[{"$nulls":4},"II",4]
[{"$nulls":4},"III",3]
[{"$nulls":4},"IV",3]
[null,null,"LG","A","I",{"$f":" IF('main Side windows 1'!$D$15>0,5+ 0.1*('main Side windows 1'!$D$15-4),\"\")","v":""},{"$nulls":3},{"$f":"IF('main Side windows 1'!$D$17=\"LG\",(IF('main Side windows 1'!$D$13=\"A\",VLOOKUP($C$48,E98:F101,2,-1),0)),0)","v":0}]
[{"$nulls":4},"II",4]
[{"$nulls":4},"III",4]
[{"$nulls":4},"IV",4]
[null,null,"LG","B","I",{"$f":" IF('main Side windows 1'!$D$15>0,5+ 0.1*('main Side windows 1'!$D$15-4),\"\")","v":""},{"$nulls":3},{"$f":"IF('main Side windows 1'!$D$17=\"LG\",(IF('main Side windows 1'!$D$13=\"B\",VLOOKUP($C$48,E102:F105,2,-1),0)),0)","v":0}]
[{"$nulls":4},"II",4]
[{"$nulls":4},"III",4]
[{"$nulls":4},"IV",4]
[null,null,"LG","C","I",{"$f":" IF('main Side windows 1'!$D$15>0,5+ 0.1*('main Side windows 1'!$D$15-4),\"\")","v":""},{"$nulls":3},{"$f":"IF('main Side windows 1'!$D$17=\"LG\",(IF('main Side windows 1'!$D$13=\"C\",VLOOKUP($C$48,E106:F109,2,-1),0)),0)","v":0}]
[{"$nulls":4},"II",4]
[{"$nulls":4},"III",3]
[{"$nulls":4},"IV",3]
[null,null,"LG","D","I",{"$f":" IF('main Side windows 1'!$D$15>0,5+ 0.1*('main Side windows 1'!$D$15-4),\"\")","v":""},{"$nulls":3},{"$f":"IF('main Side windows 1'!$D$17=\"LG\",(IF('main Side windows 1'!$D$13=\"D\",VLOOKUP($C$48,E110:F113,2,-1),0)),0)","v":0}]
[{"$nulls":4},"II",4]
[{"$nulls":4},"III",3]
[{"$nulls":4},"IV",3]
[null,null,"AMPW","A","I",{"$f":" IF('main Side windows 1'!$D$15>0,8+ 0.1*('main Side windows 1'!$D$15-4),\"\")","v":""},{"$nulls":3},{"$f":"IF('main Side windows 1'!$D$17=\"AMPW\",(IF('main Side windows 1'!$D$13=\"A\",VLOOKUP($C$48,E114:F117,2,-1),0)),0)","v":0}]
[{"$nulls":4},"II",6]
[{"$nulls":4},"III",5]
[{"$nulls":4},"IV",5]
[null,null,"AMPW","B","I",{"$f":" IF('main Side windows 1'!$D$15>0,8+ 0.1*('main Side windows 1'!$D$15-4),\"\")","v":""},{"$nulls":3},{"$f":"IF('main Side windows 1'!$D$17=\"AMPW\",(IF('main Side windows 1'!$D$13=\"B\",VLOOKUP($C$48,E118:F121,2,-1),0)),0)","v":0}]
[{"$nulls":4},"II",6]
[{"$nulls":4},"III",5]
[{"$nulls":4},"IV",5]
[null,null,"AMPW","C","I",{"$f":" IF('main Side windows 1'!$D$15>0,8+ 0.1*('main Side windows 1'!$D$15-4),\"\")","v":""},{"$nulls":3},{"$f":"IF('main Side windows 1'!$D$17=\"AMPW\",(IF('main Side windows 1'!$D$13=\"C\",VLOOKUP($C$48,E122:F125,2,-1),0)),0)","v":0}]
[{"$nulls":4},"II",6]
[{"$nulls":4},"III",4]
[{"$nulls":4},"IV",4]
[null,null,"AMPW","D","I",{"$f":" IF('main Side windows 1'!$D$15>0,8+ 0.1*('main Side windows 1'!$D$15-4),\"\")","v":""},{"$nulls":3},{"$f":"IF('main Side windows 1'!$D$17=\"AMPW\",(IF('main Side windows 1'!$D$13=\"D\",VLOOKUP($C$48,E126:F129,2,-1),0)),0)","v":0}]
[{"$nulls":4},"II",6]
[{"$nulls":4},"III",4]
[{"$nulls":4},"IV",4]
[null,null,"GRP m30","A","I",{"$f":" IF('main Side windows 1'!$D$15>0,4 + 0.1*('main Side windows 1'!$D$15-4),\"\")","v":""},{"$nulls":3},{"$f":"IF('main Side windows 1'!$D$17=\"GRP M30\",(IF('main Side windows 1'!$D$13=\"A\",VLOOKUP($C$48,E130:F133,2,-1),0)),0)","v":0}]
[{"$nulls":4},"II",3]
[{"$nulls":4},"III",3]
[{"$nulls":4},"IV",3]
[null,null,"GRP m30","B","I",{"$f":" IF('main Side windows 1'!$D$15>0,4 + 0.1*('main Side windows 1'!$D$15-4),\"\")","v":""},{"$nulls":3},{"$f":"IF('main Side windows 1'!$D$17=\"GRP M30\",(IF('main Side windows 1'!$D$13=\"B\",VLOOKUP($C$48,E134:F137,2,-1),0)),0)","v":0}]
[{"$nulls":4},"II",3]
[{"$nulls":4},"III",3]
[{"$nulls":4},"IV",3]
[null,null,"GRP m30","C","I",{"$f":" IF('main Side windows 1'!$D$15>0,4 + 0.1*('main Side windows 1'!$D$15-4),\"\")","v":""},{"$nulls":3},{"$f":"IF('main Side windows 1'!$D$17=\"GRP M30\",(IF('main Side windows 1'!$D$13=\"C\",VLOOKUP($C$48,E138:F141,2,-1),0)),0)","v":0}]
[{"$nulls":4},"II",3]
[{"$nulls":4},"III",2]
[{"$nulls":4},"IV",2]
[null,null,"GRP m30","D","I",{"$f":" IF('main Side windows 1'!$D$15>0,4 + 0.1*('main Side windows 1'!$D$15-4),\"\")","v":""},{"$nulls":3},{"$f":"IF('main Side windows 1'!$D$17=\"GRP M30\",(IF('main Side windows 1'!$D$13=\"D\",VLOOKUP($C$48,E142:F145,2,-1),0)),0)","v":0}]
[{"$nulls":4},"II",3]
[{"$nulls":4},"III",2]
[{"$nulls":4},"IV",2]
[null,null,"GRP m35","A","I",{"$f":" IF('main Side windows 1'!$D$15>0,4 + 0.1*('main Side windows 1'!$D$15-4),\"\")","v":""},{"$nulls":3},{"$f":"IF('main Side windows 1'!$D$17=\"GRP M35\",(IF('main Side windows 1'!$D$13=\"A\",VLOOKUP($C$48,E146:F149,2,-1),0)),0)","v":0}]
[{"$nulls":4},"II",3]
[{"$nulls":4},"III",3]
[{"$nulls":4},"IV",3]
[null,null,"GRP m35","B","I",{"$f":" IF('main Side windows 1'!$D$15>0,4 + 0.1*('main Side windows 1'!$D$15-4),\"\")","v":""},{"$nulls":3},{"$f":"IF('main Side windows 1'!$D$17=\"GRP M35\",(IF('main Side windows 1'!$D$13=\"B\",VLOOKUP($C$48,E150:F153,2,-1),0)),0)","v":0}]
[{"$nulls":4},"II",3]
[{"$nulls":4},"III",3]
[{"$nulls":4},"IV",3]
[null,null,"GRP m35","C","I",{"$f":" IF('main Side windows 1'!$D$15>0,4 + 0.1*('main Side windows 1'!$D$15-4),\"\")","v":""},{"$nulls":3},{"$f":"IF('main Side windows 1'!$D$17=\"GRP M35\",(IF('main Side windows 1'!$D$13=\"C\",VLOOKUP($C$48,E154:F157,2,-1),0)),0)","v":0}]
[{"$nulls":4},"II",3]
[{"$nulls":4},"III",2]
[{"$nulls":4},"IV",2]
[null,null,"GRP m35","D","I",{"$f":" IF('main Side windows 1'!$D$15>0,4 + 0.1*('main Side windows 1'!$D$15-4),\"\")","v":""},{"$nulls":3},{"$f":"IF('main Side windows 1'!$D$17=\"GRP M35\",(IF('main Side windows 1'!$D$13=\"D\",VLOOKUP($C$48,E158:F161,2,-1),0)),0)","v":0}]
[{"$nulls":4},"II",3]
[{"$nulls":4},"III",2]
[{"$nulls":4},"IV",2]
[null,null,"Al 5038","A","I",{"$f":" IF('main Side windows 1'!$D$15>0,3 + 0.05*('main Side windows 1'!$D$15-4),\"\")","v":""},{"$nulls":3},{"$f":"IF('main Side windows 1'!$D$17=\"Al 5038\",(IF('main Side windows 1'!$D$13=\"A\",VLOOKUP($C$48,E162:F165,2,-1),0)),0)","v":0}]
[{"$nulls":4},"II",3]
[{"$nulls":4},"III",3]
[{"$nulls":4},"IV",3]
[null,null,"Al 5038","B","I",{"$f":" IF('main Side windows 1'!$D$15>0,3 + 0.05*('main Side windows 1'!$D$15-4),\"\")","v":""},{"$nulls":3},{"$f":"IF('main Side windows 1'!$D$17=\"AL 5038\",(IF('main Side windows 1'!$D$13=\"B\",VLOOKUP($C$48,E166:F169,2,-1),0)),0)","v":0}]
[{"$nulls":4},"II",3]
[{"$nulls":4},"III",3]
[{"$nulls":4},"IV",3]
[null,null,"Al 5038","C","I",{"$f":" IF('main Side windows 1'!$D$15>0,3 + 0.05*('main Side windows 1'!$D$15-4),\"\")","v":""},{"$nulls":3},{"$f":"IF('main Side windows 1'!$D$17=\"AL 5038\",(IF('main Side windows 1'!$D$13=\"C\",VLOOKUP($C$48,E170:F173,2,-1),0)),0)","v":0}]
[{"$nulls":4},"II",3]
[{"$nulls":4},"III",2]
[{"$nulls":4},"IV",2]
[null,null,"Al 5038","D","I",{"$f":" IF('main Side windows 1'!$D$15>0,3 + 0.05*('main Side windows 1'!$D$15-4),\"\")","v":""},{"$nulls":3},{"$f":"IF('main Side windows 1'!$D$17=\"AL 5038\",(IF('main Side windows 1'!$D$13=\"D\",VLOOKUP($C$48,E174:F177,2,-1),0)),0)","v":0}]
[{"$nulls":4},"II",3]
[{"$nulls":4},"III",2]
[{"$nulls":4},"IV",2]
[null,null,"MS","A","I",{"$f":" IF('main Side windows 1'!$D$15>0,2.5 + 0.025*('main Side windows 1'!$D$15-4),\"\")","v":""},{"$nulls":3},{"$f":"IF('main Side windows 1'!$D$17=\"MS\",(IF('main Side windows 1'!$D$13=\"A\",VLOOKUP($C$48,E178:F181,2,-1),0)),0)","v":0}]
[{"$nulls":4},"II",2.5]
[{"$nulls":4},"III",2.5]
[{"$nulls":4},"IV",2.5]
[null,null,"MS","B","I",{"$f":" IF('main Side windows 1'!$D$15>0,2.5 + 0.025*('main Side windows 1'!$D$15-4),\"\")","v":""},{"$nulls":3},{"$f":"IF('main Side windows 1'!$D$17=\"MS\",(IF('main Side windows 1'!$D$13=\"B\",VLOOKUP($C$48,E182:F185,2,-1),0)),0)","v":0}]
[{"$nulls":4},"II",2.5]
[{"$nulls":4},"III",2.5]
[{"$nulls":4},"IV",2.5]
[null,null,"MS","C","I",{"$f":" IF('main Side windows 1'!$D$15>0,2.5 + 0.025*('main Side windows 1'!$D$15-4),\"\")","v":""},{"$nulls":3},{"$f":"IF('main Side windows 1'!$D$17=\"MS\",(IF('main Side windows 1'!$D$13=\"C\",VLOOKUP($C$48,E186:F189,2,-1),0)),0)","v":0}]
[{"$nulls":4},"II",2.5]
[{"$nulls":4},"III",2]
[{"$nulls":4},"IV",2]
[null,null,"MS","D","I",{"$f":" IF('main Side windows 1'!$D$15>0,2.5 + 0.025*('main Side windows 1'!$D$15-4),\"\")","v":""},{"$nulls":3},{"$f":"IF('main Side windows 1'!$D$17=\"MS\",(IF('main Side windows 1'!$D$13=\"D\",VLOOKUP($C$48,E190:F193,2,-1),0)),0)","v":0}]
[{"$nulls":4},"II",2.5]
[{"$nulls":4},"III",2]
[{"$nulls":4},"IV",2]

{"sheet":"Worksheet 2","index":7,"n_rows":45,"n_cols":31,"rows_kept":45,"merged":[[0,0,0,9],[0,11,0,12],[1,0,1,9],[2,0,2,9],[4,0,4,9],[6,0,6,5],[17,13,17,14],[19,13,19,14],[21,12,21,14],[22,15,26,18],[27,6,28,6],[27,7,28,7],[27,15,27,21],[29,15,32,15],[29,16,32,16],[29,17,32,17],[29,18,29,21],[30,18,30,21],[31,18,31,19],[32,11,32,13],[34,13,34,14],[36,13,36,14],[38,13,38,14],[39,13,39,14],[41,13,41,14]]}
[{"$nulls":11},"Comments"]
["ISO 12216:2020 - Small craft - Windows, portlights, hatches, deadlights and doors",{"$nulls":11},"Derived values"]
["WORKSHEET No. 1 data entry",{"$nulls":11},"Input values"]
[]
[{"$f":"CONCATENATE(coverSheet!B5,\"   \",coverSheet!B12,\"    \",Summary!B10)","v":"       "}]
[]
["Parameter",{"$nulls":5},"Symbol","Unit","Value","Ref.",{"$nulls":5},"Material Properties see table F.1 and Tab. 5",{"$nulls":11},"List"]
["Form of plate (Rectangular / Circle)",{"$nulls":5},"R / C",null,{"$f":"Summary!C10","v":0},"Annex C",{"$nulls":5},"Table F.1 mechanical properties [MPa]",null,null,"Tab. 5",{"$nulls":8},"Lists"]
["Long side",{"$nulls":5},"a","mm",{"$f":"Summary!D10","v":0},"7.3, Annex C",{"$nulls":5},"Material","strength","elasticity","safety",{"$nulls":7},"rectangular","R","I","A",{"$f":"IF(I8=\"rectangular\",\"R\",IF(I8=\"circle\",\"C\",\"\"))","v":""}]
["Unsupported short side",{"$nulls":5},"b","mm",{"$f":"Summary!E10","v":0},"7.3, Annex C",{"$nulls":5},"PMMA",110,3000,3.5,{"$nulls":7},"circle","C","IIa","B"]
["Diameter",{"$nulls":5},"d","mm",{"$f":"Summary!F10","v":0},"7.3, Annex C",{"$nulls":5},"PC",90,2400,3.5,{"$nulls":9},"IIb","C"]
["Curve height",{"$nulls":5},"c","mm",{"$f":"Summary!G10","v":0},"7.6",{"$nulls":5},"TG",200,72600,4,{"$nulls":9},"III","D"]
["Support SemiFixed / Simply Supported",{"$nulls":5},"SF / SS",null,{"$f":"Summary!H10","v":0},"3.18",{"$nulls":5},"CG",300,72600,4,{"$nulls":7},"semi-fixed","SF","IV",null,{"$f":"IF(I13=\"semi-fixed\",\"SF\",IF(I13=\"\",\"\",\"SS\"))","v":"SS"}]
["Location type",{"$nulls":5},"I/IIA/IIB/III/IV",null,{"$f":"Summary!I10","v":0},"3.17; Annex A",{"$nulls":5},"AG",40,72600,4,{"$nulls":7},"simply supported","SS"]
["Location area (only loc. III)",{"$nulls":5},"F / S / Any",null,{"$f":"Summary!J10","v":0},"3.17.4",{"$nulls":5},"AMPW",50,7000,2]
["Design Category",{"$nulls":5},"A / B / C / D",null,{"$f":"Summary!K10","v":0},"3.12",{"$nulls":5},"GRP M30",140,7500,2,{"$nulls":6},"any","front","F","Any","yes",{"$f":"IF(I15=\"front\",\"F\",IF(I15=\"side\",\"S\",IF(I15=\"any\",\"A\",\"\")))","v":""}]
["Craft Type Any/Motor/Sail",{"$nulls":5},"Any / M / S",null,{"$f":"Summary!L10","v":0},{"$nulls":6},"GRP M35",175,10000,2,{"$nulls":6},"motor","side","S","M","no"]
["Length of hull as in ISO 8666",{"$nulls":5},"LH","m",{"$f":"Summary!N10","v":{"v":0,"d":"0.00"}},"3.16",{"$nulls":5},"AL 5038",280,70000,2,{"$nulls":6},"sail","any","Any","S",null,{"$f":"IF(I17=\"any\",\"Any\",IF(I17=\"motor\",\"M\",IF(I17=\"sail\",\"S\",\"\")))","v":""}]
["Material data",{"$nulls":7},{"$f":"Summary!O10","v":0},"Table F.1 & 5",{"$nulls":5},"MS",400,200000,2]
[null,"  Ultimate flexural strength",{"$nulls":4},"σU","MPa",{"$f":"'main Side windows 2'!D18","v":{"$error":"#N/A"}},"Table F.1 & 5",{"$nulls":5},"AISI 316 L",510,200000,2]
[null,"  Modulus of elasticity",{"$nulls":4},"E","MPa",{"$f":"'main Side windows 2'!D19","v":{"$error":"#N/A"}},"Table F.1 & 5"]
[null,"  Safety factor",{"$nulls":4},"gamma",". / .",{"$f":"'main Side windows 2'!D20","v":{"$error":"#N/A"}},"Table F.1 & 5",{"$nulls":15},"yes"]
["Is actual plate a sandwich?",{"$nulls":5},"yes / no",null,{"$f":"Summary!Q10","v":0},"7.9",{"$nulls":5},{"$f":"IF(I23=\"YES\",\"The difference in thickness between any two glass plies must be less than or equal to 2 mm and the thickness of the plastic interlayer must be less than, or equal to 0,76 mm for these conditions !\",\"\")","v":""},{"$nulls":9},"no"]
[null,"If yes, enter number of layers",{"$nulls":5},". / .",{"$f":"Summary!R10","v":0},"7.9"]
["Actual plate thickness (in case of sandwich the sum of all layers)",{"$nulls":6},"mm",{"$f":"Summary!U10","v":{"v":0,"d":"0.00"}}]
[]
["Results for non-stiffened plates"]
["Press reduction factor",{"$nulls":5},"Ψ",". / .",{"$f":"'main Side windows 2'!D23","v":false},"7.5"]
["              within limits 0,33 and 1,0",{"$nulls":7},{"$f":"'main Side windows 2'!D24","v":1},"7.5",{"$nulls":5},"Table 5 — Safety factor and minimum thickness of monolithic plates"]
["Basic design press",{"$nulls":5},"p","kPa",{"$f":"'main Side windows 2'!D25","v":1},"7.4",{"$nulls":5},"Material","Acronym","Safety factor\n γ ","Minimum thickness of monolithic plates, tm"]
["Allowable flexural stress",{"$nulls":5},"σa","MPa",{"$f":"'main Side windows 2'!D26","v":{"$error":"#N/A"}},"7.8",{"$nulls":8},"Design categories "]
["Curvature coefficient",{"$nulls":5},"kC",". / .",{"$f":"'main Side windows 2'!D27","v":{"$error":"#DIV/0!"}},"7.6",{"$nulls":8},"Any",null,"A & B","C & D"]
["Ratio a/b (valid ≤ 5)",{"$nulls":6},". / .",{"$f":"'main Side windows 2'!D28","v":{"$error":"#DIV/0!"}},"7.3, Annex G.2",{"$nulls":8},"Area Ia","Area II","Area III & IV","Area III & IV"]
["Ratio a/b corrected",{"$nulls":6},". / .",{"$f":"'main Side windows 2'!D29","v":{"$error":"#DIV/0!"}},"7.3, Annex G.2",{"$nulls":5},"Poly(methyl)methacrylate","PMMA",3.5,"6+0,1(LH-4)",6,5,4]
["Plate aspect ratio coeff stress",{"$nulls":5},"kr",". / .",{"$f":"'main Side windows 2'!D30","v":"FALSCH"},"7.3, Annex G.2",{"$nulls":5},"Polycarbonate","PC",3.5,"6+0,1(LH-4)",6,5,4]
["Pate aspect ratio coeff deflection",{"$nulls":5},"kf",". / .",{"$f":"'main Side windows 2'!D31","v":false},"7.3, Annex G.2",{"$nulls":5},"Monolithic tempered glass ","TG",4,"5+0,1(LH-4)b",4,4,3]
[{"$nulls":15},"Laminated glass ","LG",4,"5+0,1(LH-4)b",4,4,3]
["Thickness (Stress)",{"$nulls":5},"tr","mm",{"$f":"'main Side windows 2'!D33","v":{"$error":"#DIV/0!"}},"7.1.1",{"$nulls":5},"All mahogany plywood ","AMPW",2,"8+0,1(LH-4)",6,5,4]
["Thickness (Deflection)",{"$nulls":5},"tf","mm",{"$f":"'main Side windows 2'!D34","v":{"$error":"#DIV/0!"}},"7.1.2",{"$nulls":5},"GRP mat 30 % glass ","GRP M30",2,"4+0,1(LH-4)",3,3,2]
["Thickness",{"$nulls":6},"mm",{"$f":"'main Side windows 2'!D35","v":{"$error":"#DIV/0!"}},{"$nulls":6},"GRP mat/roving 35 % glass ","GRP M35",2,"4+0,1(LH-4)",3,3,2]
["Thickness minimu, techn. ",{"$nulls":5},"tm","mm",{"$f":"'main Side windows 2'!D36","v":{"$error":"#DIV/0!"}},"7.8",{"$nulls":5},"Aluminium alloy 5083-H111 ","AL 5038",2,"3+0,05 (LH-4)",3,3,2]
["Thickness minimum, Tab 5",{"$nulls":6},"mm",{"$f":"'main Side windows 2'!D37","v":{"v":0,"d":"0.0"}},"Table 5",{"$nulls":5},"Mild steel ","MS",2,"2,5+0,025 (LH-4)",2.5,2.5,2]
[]
["Required plate thickness",{"$nulls":6},"mm",{"$f":"'main Side windows 2'!I31","v":{"$error":"#DIV/0!"}}]
["Requirements fullfilled?",{"$nulls":7},{"$f":"IF(L13=\"short side in area I max 300mm\",\"FAIL\",IF(I25>=I44,\"PASS\",\"FAIL\"))","v":{"$error":"#DIV/0!"}}]

{"sheet":"main Side windows 2","index":8,"n_rows":43,"n_cols":24,"rows_kept":43,"hidden":true,"merged":[[0,0,0,5],[1,0,1,5],[25,11,28,18],[26,6,26,7]]}
[{"$nulls":6},"manufacturer"]
[{"$nulls":6},"model name"]
["Eingabe","Version 1.2.2 / 15-03-2006 rev 060512/070507/dew 090918",{"$nulls":4},"ISO/FDIS 12216:2002(E)"]
["Parameter Input","SSign","Item/Unit",{"$nulls":18},"Lists"]
["form of plate Rectangular/Circle",null,"R/C",{"$f":"'Worksheet 2'!AE9","v":""},{"$f":"IF(D5=\"\",\"Input R oder C\",\"\")","v":"Input R oder C"},null,"Material Properties see table F.1 and Tab. 5",{"$nulls":14},"R","I","A"]
["long side","a","mm",{"$f":"'Worksheet 2'!I9","v":0},{"$f":"IF(AND(D5=\"R\",D6=\"\"),\"Input a requested\",IF(AND(D5=\"C\",D6=\"\"),\"Input d requested\",\"\"))","v":""},null,"Table F.1 mechanical properties [Mpa]",null,null,"Tab. 5",{"$nulls":11},"C","IIa","B"]
["unsupported short side","b","mm",{"$f":"'Worksheet 2'!I10","v":0},{"$f":"IF(AND(D5=\"R\",D7=\"\"),\"Input b requested\",IF(AND(D5=\"C\",D7=\"\"),\"Input d requested\",\"\"))","v":""},null,"Material","strength","elasticity","safety",{"$nulls":12},"IIb","C"]
["diameter","d","mm",{"$f":"'Worksheet 2'!I11","v":0},{"$f":"IF(AND(D5=\"C\",D8=\"\"),\"Input d requested\",\"\")","v":""},null,"PMMA",110,3000,3.5,{"$nulls":3},"AG",40,72600,4,{"$nulls":5},"III","D"]
["curve height","c","mm",{"$f":"'Worksheet 2'!I12","v":0},"optional",null,"PC",90,2400,3.5,{"$nulls":3},"AISI 316 L",510,200000,2,{"$nulls":4},"SF","IV"]
["support SemiFixed/Simple Supp.",null,"SF/SS",{"$f":"'Worksheet 2'!AE13","v":"SS"},{"$f":"IF(D10=\"\",\"Input SF or SS\",\"\")","v":""},null,"TG",200,72600,4,null,null,"6.1","AL 5038",280,70000,2,{"$nulls":4},"SS"]
["Location type",null,"I/IIA/IIB/III/IV",{"$f":"'Worksheet 2'!I14","v":{"v":0,"d":"0.00"}},{"$f":"IF(D11=\"\",\"Input I / IIa,b / III / IV\",\"\")","v":""},null,"CG",300,72600,4,null,null,"3.17.1-4","AMPW",50,7000,2]
["Location area (only loc. III)",null,"F/S/A",{"$f":"'Worksheet 2'!AE16","v":""},{"$f":"IF(D12=\"F\",\"\",IF(D12=\"S\",\"\",IF(D12=\"A\",\"\",IF(D11=\"III\",\"Input F / S / A\",\"\"))))","v":""},null,"AG",40,72600,4,{"$nulls":3},"CG",300,72600,4,{"$nulls":4},"F","Any","yes"]
["Design Category",null,"A/B/C/D",{"$f":"IF('Worksheet 2'!I16=\"\",\"\",'Worksheet 2'!I16)","v":{"v":0,"d":"0.00"}},{"$f":"IF(D13=\"\",\"Input A / B / C / D\",\"\")","v":""},null,"AMPW",50,7000,2,{"$nulls":3},"GRP M30",140,7500,2,{"$nulls":4},"S","M","no"]
["Craft Type Any/Motor/Sail",null,"Any/M/S",{"$f":"'Worksheet 2'!AE18","v":""},{"$f":"IF(D14=\"\",\"Input Any / M / S\",\"\")","v":"Input Any / M / S"},null,"GRP M30",140,7500,2,{"$nulls":3},"GRP M35",175,10000,2,{"$nulls":4},"A","S"]
["optional: craft length of hull",null,"m",{"$f":"'Worksheet 2'!I18","v":{"v":0,"d":"0.00"}},"default, change if smaller",null,"GRP M35",175,10000,2,{"$nulls":3},"MS",400,200000,2]
[{"$nulls":6},"AL 5038",280,70000,2,{"$nulls":3},"PC",90,2400,3.5]
["Material",null,"see Tab. F.1",{"$f":"'Worksheet 2'!I19","v":{"v":0,"d":"0.00"}},{"$f":"IF(D17=\"\",\"manual input requ\",\"\")","v":""},null,"MS",400,200000,2,{"$nulls":3},"PMMA",110,3000,3.5]
["  ultimate flexural strength","Sigma u",null,{"$f":"LOOKUP(D17,N8:N18,O8:O18)","v":{"$error":"#N/A"}},"falls nicht in F.1 ",null,"AISI 316 L",510,200000,2,{"$nulls":3},"TG",200,72600,4]
["  modulus of elasticity","E",null,{"$f":"LOOKUP(D17,N8:N18,P8:P18)","v":{"$error":"#N/A"}},"Werte manuell"]
["  safety factor","gamma",null,{"$f":"LOOKUP(D17,N8:N18,Q8:Q18)","v":{"$error":"#N/A"}},"eintragen"]
[]
["Results for non-stiffened plates"]
["press reduction factor",null,null,{"$f":"IF(D5=\"R\",1.102-0.0004*D7,IF(D5=\"C\",1.102-0.0004*D8))","v":false},"(7.5)"]
["              within limits 0,33 and 1,0","psi",null,{"$f":"IF(D23<0.33,0.33,IF(D23>1,1,D23))","v":{"v":1,"d":"1.000"}},"(7.5)"]
["basic design press","p","KPa",{"$f":"'basic design pressure 2'!G43","v":{"v":1,"d":"1.00"}},"(7.4)",null,"see work sheet \"basic design press\""]
["allowable flexural stress","Sigma a","MPa",{"$f":"D18/D20","v":{"$error":"#N/A"}},"(7.8)",null,"is actual plate a sandwich?",null,{"$f":"'Worksheet 2'!I23","v":0},null,null,{"$f":"IF(I26=\"YES\",\"the difference in thickness between any two glass plies must be less than or equal to 2 mm and the thickness of the plastic interlayer must be less than, or equal to 0,76 mm for these conditions !\",\"\")","v":""}]
["curvature coefficient","kc",null,{"$f":"IF(D5=\"C\",1-(D9/D8),1-(D9/D7))","v":{"$error":"#DIV/0!"}},"(7.6)",null,{"$f":"IF(I26=\"yes\", \"number of layers?\",\"\")","v":""},null,{"$f":"IF('Worksheet 2'!I24=\"\",\"\",'Worksheet 2'!I24)","v":0}]
["              a/b real  (valid ≤ 5)",null,null,{"$f":"IF(D5=\"C\",1,D6/D7)","v":{"$error":"#DIV/0!"}},"(7.3) Annex G.2"]
["              a/b corrected",null,null,{"$f":"IF(D28>5,5,D28)","v":{"$error":"#DIV/0!"}},"(7.3) Annex G.2"]
["plate aspect ratio coeff stress","kr",null,{"$f":"IF(D5=\"R\",IF(D10=\"SF\",(0.62165*D29^2-0.6473*D29+0.26481)/(D29^2-1.173*D29+0.97671),IF(D10=\"SS\",(0.69952*D29^2+0.02662*D29-0.0735)/(D29^2-0.7185*D29+1.98925),\"Fehler\")),IF(D5=\"C\",IF(D10=\"SF\",0.248,0.309),\"FALSCH\"))","v":"FALSCH"},"(7.3) Annex G.2",null,"actual plate Thickness",null,{"$f":"'Worksheet 2'!I25","v":0},"mm",null,{"$f":"IF(I26=\"yes\", \"=sum of all plies\",\"\")","v":""}]
["pate aspect ratio coeff deflection","kf",null,{"$f":"IF(D5=\"R\",IF(D10=\"SF\",(0.08052*D29^2-0.0272*D29-0.0019)/(D29^2-0.9275*D29+1.70018),IF(D10=\"SS\",(0.12915*D29^2+0.00868*D29-0.0293)/(D29^2-0.887*D29+2.3372),\"Fehler\")),IF(D5=\"C\",IF(D10=\"SF\",0.027,0.043)))","v":false},"(7.3) Annex G.2",null,"required plate thickness",null,{"$f":"IF(AND(I26=\"Yes\",I27=\"\"),\"please enter number of layers\",IF(AND(I26=\"Yes\",I27>2),1.5*MAX(D35:D37),IF(AND(I26=\"Yes\",I27=2),1.2*MAX(D35:D37),IF(I36=\"Yes\",MAX(D36:D37),MAX(D35:D37)))))","v":{"$error":"#DIV/0!"}}]
[{"$nulls":6},"requirements fulfilled?",null,{"$f":"IF(I30=\"\",\"\",IF(I30>=I31,\"PASS\",\"FAIL\"))","v":{"$error":"#DIV/0!"}}]
["Thickness (Stress)","tr","mm",{"$f":"IF(D5=\"C\",D8*D27*SQRT(D30*D24*D25/D26/1000),D7*D27*SQRT(D30*D24*D25/D26/1000))","v":{"$error":"#DIV/0!"}},"(7.1.1)"]
["Thickness (Deflection)","tf","mm",{"$f":"0.45*(D33+D7*D27*POWER((D31*D24*D25/0.02/D19/1000),0.33333))","v":{"$error":"#DIV/0!"}},"(7.1.2)"]
["Thickness",null,null,{"$f":"ROUND(MAX(D33:D34),2)","v":{"$error":"#DIV/0!"}},"(7.1.7)",{"$nulls":3},"Minimum tech used???"]
["Thickness minimu, techn. ",null,"mm",{"$f":"D35-0.5","v":{"$error":"#DIV/0!"}},null,null," = Minimum, absolute",null,{"$f":"Summary!P10","v":0}]
["Thickness minimum, Tab 5","tm","mm",{"$f":"'basic design pressure 2'!J48","v":{"v":0,"d":"0.0"}},"(Tab. 5)",null,"(only PMMA, PC, TG, LG)"]
[]
["Escape Hatch possible ?"]
["Required ISO 9094-1, 2"]
["Circular: inner Diam > 450 mm",null,null,{"$f":"IF(D5=\"C\",IF(D8>450,\"pass\",\"fail\"),\"n.a.\")","v":"n.a."}]
["Rectang: inner Diam > 380 mm",null,null,{"$f":"IF(D5=\"R\",IF(MAX(D6:D7)>380,\"pass\",\"fail\"),\"n.a.\")","v":"n.a."}]
["              Area > 180000 mm²",null,null,{"$f":"IF(D5=\"R\",IF(D6*D7>180000,\"pass\",\"fail\"),\"n.a.\")","v":"n.a."}]

{"sheet":"basic design pressure 2","index":9,"n_rows":193,"n_cols":10,"rows_kept":193,"hidden":true}
["Basic design pressure",null,null,"(7.4 Table 4)"]
[]
["location",null,{"$f":"'main Side windows 2'!D11","v":0}]
["particular",null,{"$f":"IF(AND(C5=\"C\",C6=\"M\",C3=\"III\"),\"A\",'main Side windows 2'!D12)","v":""},null,"Remark: f=front, s=side"]
["design cat",null,{"$f":"'main Side windows 2'!D13","v":0}]
["craft type",null,{"$f":"'main Side windows 2'!D14","v":""},{"$f":"IF(C6=\"Any\",\"S\",C6)","v":""},"Remark: if craft type = Any, set craft type = S"]
[]
[]
["Tabelle 4",null,"location","craft type","design cat","particular","pressure"]
[null,null,"I","Any","Any","Any",70]
[null,null,"IIB","Any","A","Any",70]
[null,null,"IIB","Any","B","Any",50]
[null,null,"IIB","Any","C","Any",28]
[null,null,"IIB","Any","D","Any",28]
[null,null,"IIA","Any","Any","Any",28]
[null,null,"III","S","A","Any",18]
[null,null,"III","S","B","Any",18]
[null,null,"III","S","C","Any",12]
[null,null,"III","S","D","Any",12]
[null,null,"III","M","A","Front",12]
[null,null,"III","M","A","Any",12]
[null,null,"III","M","B","Front",9]
[null,null,"III","M","B","Any",9]
[null,null,"III","M","D","Front",6,null,null,"Korrektur, Zeile eingefügt um Fehler bei eingabe III, M, Front, D zu beheben"]
[null,null,"III","M","A","Side",9]
[null,null,"III","M","B","Side",6]
[null,null,"III","M","C","Any",6]
[null,null,"III","M","D","Any",6]
[null,null,"IV","S","Any","Any",12]
[null,null,"IV","M","Any","Any",6]
[]
["Ergebnis"]
[null,"location = I",{"$nulls":4},{"$f":"IF(C3=\"I\",G10,0)","v":0}]
[null,"location = IIB",{"$nulls":4},{"$f":"IF(C3=\"IIB\",VLOOKUP(C5,E11:G15,3),0)","v":0}]
[null,"location = IIA",{"$nulls":4},{"$f":"IF(C3=\"IIA\",VLOOKUP(C3,E11:G15,3),0)","v":0}]
[null,"location = III","craft = S",{"$nulls":3},{"$f":"IF(AND(C3=\"III\",D6=\"S\"),VLOOKUP(C5,E16:G19,3),0)","v":0}]
[null,"location = III","craft = M","particular = front",null,null,{"$f":"IF(AND(C3=\"III\",D6=\"M\",C4=\"F\"),VLOOKUP(C5,E20:G24,3),0)","v":0}]
[null,"location = III","craft = M","particular = any",null,null,{"$f":"IF(AND(OR(C5=\"A\",C5=\"B\"),C3=\"III\",D6=\"M\",C4=\"A\"),VLOOKUP(C5,E20:G24,3),0)","v":0}]
[null,"location = III","craft = M","particular = side",null,null,{"$f":"IF(AND(C3=\"III\",C6=\"M\",C4=\"S\"),IF(C5=\"A\",9,IF(C5=\"B\",6,0)))","v":false}]
[null,"location = III","craft = M",{"$nulls":3},{"$f":"IF(C5=\"A\",0,IF(C5=\"B\",0,IF(AND(C3=\"III\",C6=\"M\"),VLOOKUP(C5,E27:G28,3))))","v":false}]
[null,"location = IV",{"$nulls":4},{"$f":"IF(C3=\"IV\",VLOOKUP(D6,D29:G30,4,0),1)","v":1}]
[]
["pressure",{"$nulls":5},{"$f":"MAX(G33:G41)","v":1}]
[]
[]
["minimum thickness"]
[]
[null,"Area",{"$f":"IF(OR('main Side windows 2'!D11=\"IIA\",'main Side windows 2'!D11=\"IIB\"),\"II\",'main Side windows 2'!D11)","v":0},{"$nulls":4},"minimum thickness",null,{"$f":"MAX(J50:J190)","v":0}]
[]
[null,null,"PMMA","A","I",{"$f":" IF('main Side windows 2'!$D$15>0,6 + 0.1*('main Side windows 2'!$D$15-4),\"\")","v":""},{"$nulls":3},{"$f":"IF('main Side windows 2'!$D$17=\"PMMA\",(IF('main Side windows 2'!$D$13=\"A\",VLOOKUP($C$48,$E$50:$F$53,2,-1),0)),0)","v":0}]
["Table 5",{"$nulls":3},"II",6]
[{"$nulls":4},"III",5]
[{"$nulls":4},"IV",5]
[null,null,"PMMA","B","I",{"$f":" IF('main Side windows 2'!$D$15>0,6 + 0.1*('main Side windows 2'!$D$15-4),\"\")","v":""},{"$nulls":3},{"$f":"IF('main Side windows 2'!$D$17=\"PMMA\",(IF('main Side windows 2'!$D$13=\"B\",VLOOKUP($C$48,$E$54:$F$57,2,-1),0)),0)","v":0}]
[{"$nulls":4},"II",6]
[{"$nulls":4},"III",5]
[{"$nulls":4},"IV",5]
[null,null,"PMMA","C","I",{"$f":" IF('main Side windows 2'!$D$15>0,6 + 0.1*('main Side windows 2'!$D$15-4),\"\")","v":""},{"$nulls":3},{"$f":"IF('main Side windows 2'!$D$17=\"PMMA\",(IF('main Side windows 2'!$D$13=\"C\",VLOOKUP($C$48,$E$58:$F$61,2,-1),0)),0)","v":0}]
[{"$nulls":4},"II",6]
[{"$nulls":4},"III",4]
[{"$nulls":4},"IV",4]
[null,null,"PMMA","D","I",{"$f":" IF('main Side windows 2'!$D$15>0,6 + 0.1*('main Side windows 2'!$D$15-4),\"\")","v":""},{"$nulls":3},{"$f":"IF('main Side windows 2'!$D$17=\"PMMA\",(IF('main Side windows 2'!$D$13=\"D\",VLOOKUP($C$48,E62:F65,2,-1),0)),0)","v":0}]
[{"$nulls":4},"II",6]
[{"$nulls":4},"III",4]
[{"$nulls":4},"IV",4]
[null,null,"PC","A","I",{"$f":" IF('main Side windows 2'!$D$15>0,6 + 0.1*('main Side windows 2'!$D$15-4),\"\")","v":""},{"$nulls":3},{"$f":"IF('main Side windows 2'!$D$17=\"PC\",(IF('main Side windows 2'!$D$13=\"A\",VLOOKUP($C$48,E66:F69,2,-1),0)),0)","v":0}]
[{"$nulls":4},"II",6]
[{"$nulls":4},"III",5]
[{"$nulls":4},"IV",5]
[null,null,"PC","B","I",{"$f":" IF('main Side windows 2'!$D$15>0,6 + 0.1*('main Side windows 2'!$D$15-4),\"\")","v":""},{"$nulls":3},{"$f":"IF('main Side windows 2'!$D$17=\"PC\",(IF('main Side windows 2'!$D$13=\"B\",VLOOKUP($C$48,E70:F73,2,-1),0)),0)","v":0}]
[{"$nulls":4},"II",6]
[{"$nulls":4},"III",5]
[{"$nulls":4},"IV",5]
[null,null,"PC","C","I",{"$f":" IF('main Side windows 2'!$D$15>0,6 + 0.1*('main Side windows 2'!$D$15-4),\"\")","v":""},{"$nulls":3},{"$f":"IF('main Side windows 2'!$D$17=\"PC\",(IF('main Side windows 2'!$D$13=\"C\",VLOOKUP($C$48,E74:F77,2,-1),0)),0)","v":0}]
[{"$nulls":4},"II",6]
[{"$nulls":4},"III",4]
[{"$nulls":4},"IV",4]
[null,null,"PC","D","I",{"$f":" IF('main Side windows 2'!$D$15>0,6 + 0.1*('main Side windows 2'!$D$15-4),\"\")","v":""},{"$nulls":3},{"$f":"IF('main Side windows 2'!$D$17=\"PC\",(IF('main Side windows 2'!$D$13=\"D\",VLOOKUP($C$48,E78:F81,2,-1),0)),0)","v":0}]
[{"$nulls":4},"II",6]
[{"$nulls":4},"III",4]
[{"$nulls":4},"IV",4]
[null,null,"TG","A","I",{"$f":" IF('main Side windows 2'!$D$15>0,5+ 0.1*('main Side windows 2'!$D$15-4),\"\")","v":""},{"$nulls":3},{"$f":"IF('main Side windows 2'!$D$17=\"TG\",(IF('main Side windows 2'!$D$13=\"A\",VLOOKUP($C$48,E82:F85,2,-1),0)),0)","v":0}]
[{"$nulls":4},"II",4]
[{"$nulls":4},"III",4]
[{"$nulls":4},"IV",4]
[null,null,"TG","B","I",{"$f":" IF('main Side windows 2'!$D$15>0,5+ 0.1*('main Side windows 2'!$D$15-4),\"\")","v":""},{"$nulls":3},{"$f":"IF('main Side windows 2'!$D$17=\"TG\",(IF('main Side windows 2'!$D$13=\"B\",VLOOKUP($C$48,E86:F89,2,-1),0)),0)","v":0}]
[{"$nulls":4},"II",4]
[{"$nulls":4},"III",4]
[{"$nulls":4},"IV",4]
[null,null,"TG","C","I",{"$f":" IF('main Side windows 2'!$D$15>0,5+ 0.1*('main Side windows 2'!$D$15-4),\"\")","v":""},{"$nulls":3},{"$f":"IF('main Side windows 2'!$D$17=\"TG\",(IF('main Side windows 2'!$D$13=\"C\",VLOOKUP($C$48,E90:F93,2,-1),0)),0)","v":0}]
[{"$nulls":4},"II",4]
[{"$nulls":4},"III",3]
[{"$nulls":4},"IV",3]
[null,null,"TG","D","I",{"$f":" IF('main Side windows 2'!$D$15>0,5+ 0.1*('main Side windows 2'!$D$15-4),\"\")","v":""},{"$nulls":3},{"$f":"IF('main Side windows 2'!$D$17=\"TG\",(IF('main Side windows 2'!$D$13=\"D\",VLOOKUP($C$48,E94:F97,2,-1),0)),0)","v":0}]
[{"$nulls":4},"II",4]
[{"$nulls":4},"III",3]
[{"$nulls":4},"IV",3]
[null,null,"LG","A","I",{"$f":" IF('main Side windows 2'!$D$15>0,5+ 0.1*('main Side windows 2'!$D$15-4),\"\")","v":""},{"$nulls":3},{"$f":"IF('main Side windows 2'!$D$17=\"LG\",(IF('main Side windows 2'!$D$13=\"A\",VLOOKUP($C$48,E98:F101,2,-1),0)),0)","v":0}]
[{"$nulls":4},"II",4]
[{"$nulls":4},"III",4]
[{"$nulls":4},"IV",4]
[null,null,"LG","B","I",{"$f":" IF('main Side windows 2'!$D$15>0,5+ 0.1*('main Side windows 2'!$D$15-4),\"\")","v":""},{"$nulls":3},{"$f":"IF('main Side windows 2'!$D$17=\"LG\",(IF('main Side windows 2'!$D$13=\"B\",VLOOKUP($C$48,E102:F105,2,-1),0)),0)","v":0}]
[{"$nulls":4},"II",4]
[{"$nulls":4},"III",4]
[{"$nulls":4},"IV",4]
[null,null,"LG","C","I",{"$f":" IF('main Side windows 2'!$D$15>0,5+ 0.1*('main Side windows 2'!$D$15-4),\"\")","v":""},{"$nulls":3},{"$f":"IF('main Side windows 2'!$D$17=\"LG\",(IF('main Side windows 2'!$D$13=\"C\",VLOOKUP($C$48,E106:F109,2,-1),0)),0)","v":0}]
[{"$nulls":4},"II",4]
[{"$nulls":4},"III",3]
[{"$nulls":4},"IV",3]
[null,null,"LG","D","I",{"$f":" IF('main Side windows 2'!$D$15>0,5+ 0.1*('main Side windows 2'!$D$15-4),\"\")","v":""},{"$nulls":3},{"$f":"IF('main Side windows 2'!$D$17=\"LG\",(IF('main Side windows 2'!$D$13=\"D\",VLOOKUP($C$48,E110:F113,2,-1),0)),0)","v":0}]
[{"$nulls":4},"II",4]
[{"$nulls":4},"III",3]
[{"$nulls":4},"IV",3]
[null,null,"AMPW","A","I",{"$f":" IF('main Side windows 2'!$D$15>0,8+ 0.1*('main Side windows 2'!$D$15-4),\"\")","v":""},{"$nulls":3},{"$f":"IF('main Side windows 2'!$D$17=\"AMPW\",(IF('main Side windows 2'!$D$13=\"A\",VLOOKUP($C$48,E114:F117,2,-1),0)),0)","v":0}]
[{"$nulls":4},"II",6]
[{"$nulls":4},"III",5]
[{"$nulls":4},"IV",5]
[null,null,"AMPW","B","I",{"$f":" IF('main Side windows 2'!$D$15>0,8+ 0.1*('main Side windows 2'!$D$15-4),\"\")","v":""},{"$nulls":3},{"$f":"IF('main Side windows 2'!$D$17=\"AMPW\",(IF('main Side windows 2'!$D$13=\"B\",VLOOKUP($C$48,E118:F121,2,-1),0)),0)","v":0}]
[{"$nulls":4},"II",6]
[{"$nulls":4},"III",5]
[{"$nulls":4},"IV",5]
[null,null,"AMPW","C","I",{"$f":" IF('main Side windows 2'!$D$15>0,8+ 0.1*('main Side windows 2'!$D$15-4),\"\")","v":""},{"$nulls":3},{"$f":"IF('main Side windows 2'!$D$17=\"AMPW\",(IF('main Side windows 2'!$D$13=\"C\",VLOOKUP($C$48,E122:F125,2,-1),0)),0)","v":0}]
[{"$nulls":4},"II",6]
[{"$nulls":4},"III",4]
[{"$nulls":4},"IV",4]
[null,null,"AMPW","D","I",{"$f":" IF('main Side windows 2'!$D$15>0,8+ 0.1*('main Side windows 2'!$D$15-4),\"\")","v":""},{"$nulls":3},{"$f":"IF('main Side windows 2'!$D$17=\"AMPW\",(IF('main Side windows 2'!$D$13=\"D\",VLOOKUP($C$48,E126:F129,2,-1),0)),0)","v":0}]
[{"$nulls":4},"II",6]
[{"$nulls":4},"III",4]
[{"$nulls":4},"IV",4]
[null,null,"GRP m30","A","I",{"$f":" IF('main Side windows 2'!$D$15>0,4 + 0.1*('main Side windows 2'!$D$15-4),\"\")","v":""},{"$nulls":3},{"$f":"IF('main Side windows 2'!$D$17=\"GRP M30\",(IF('main Side windows 2'!$D$13=\"A\",VLOOKUP($C$48,E130:F133,2,-1),0)),0)","v":0}]
[{"$nulls":4},"II",3]
[{"$nulls":4},"III",3]
[{"$nulls":4},"IV",3]
[null,null,"GRP m30","B","I",{"$f":" IF('main Side windows 2'!$D$15>0,4 + 0.1*('main Side windows 2'!$D$15-4),\"\")","v":""},{"$nulls":3},{"$f":"IF('main Side windows 2'!$D$17=\"GRP M30\",(IF('main Side windows 2'!$D$13=\"B\",VLOOKUP($C$48,E134:F137,2,-1),0)),0)","v":0}]
[{"$nulls":4},"II",3]
[{"$nulls":4},"III",3]
[{"$nulls":4},"IV",3]
[null,null,"GRP m30","C","I",{"$f":" IF('main Side windows 2'!$D$15>0,4 + 0.1*('main Side windows 2'!$D$15-4),\"\")","v":""},{"$nulls":3},{"$f":"IF('main Side windows 2'!$D$17=\"GRP M30\",(IF('main Side windows 2'!$D$13=\"C\",VLOOKUP($C$48,E138:F141,2,-1),0)),0)","v":0}]
[{"$nulls":4},"II",3]
[{"$nulls":4},"III",2]
[{"$nulls":4},"IV",2]
[null,null,"GRP m30","D","I",{"$f":" IF('main Side windows 2'!$D$15>0,4 + 0.1*('main Side windows 2'!$D$15-4),\"\")","v":""},{"$nulls":3},{"$f":"IF('main Side windows 2'!$D$17=\"GRP M30\",(IF('main Side windows 2'!$D$13=\"D\",VLOOKUP($C$48,E142:F145,2,-1),0)),0)","v":0}]
[{"$nulls":4},"II",3]
[{"$nulls":4},"III",2]
[{"$nulls":4},"IV",2]
[null,null,"GRP m35","A","I",{"$f":" IF('main Side windows 2'!$D$15>0,4 + 0.1*('main Side windows 2'!$D$15-4),\"\")","v":""},{"$nulls":3},{"$f":"IF('main Side windows 2'!$D$17=\"GRP M35\",(IF('main Side windows 2'!$D$13=\"A\",VLOOKUP($C$48,E146:F149,2,-1),0)),0)","v":0}]
[{"$nulls":4},"II",3]
[{"$nulls":4},"III",3]
[{"$nulls":4},"IV",3]
[null,null,"GRP m35","B","I",{"$f":" IF('main Side windows 2'!$D$15>0,4 + 0.1*('main Side windows 2'!$D$15-4),\"\")","v":""},{"$nulls":3},{"$f":"IF('main Side windows 2'!$D$17=\"GRP M35\",(IF('main Side windows 2'!$D$13=\"B\",VLOOKUP($C$48,E150:F153,2,-1),0)),0)","v":0}]
[{"$nulls":4},"II",3]
[{"$nulls":4},"III",3]
[{"$nulls":4},"IV",3]
[null,null,"GRP m35","C","I",{"$f":" IF('main Side windows 2'!$D$15>0,4 + 0.1*('main Side windows 2'!$D$15-4),\"\")","v":""},{"$nulls":3},{"$f":"IF('main Side windows 2'!$D$17=\"GRP M35\",(IF('main Side windows 2'!$D$13=\"C\",VLOOKUP($C$48,E154:F157,2,-1),0)),0)","v":0}]
[{"$nulls":4},"II",3]
[{"$nulls":4},"III",2]
[{"$nulls":4},"IV",2]
[null,null,"GRP m35","D","I",{"$f":" IF('main Side windows 2'!$D$15>0,4 + 0.1*('main Side windows 2'!$D$15-4),\"\")","v":""},{"$nulls":3},{"$f":"IF('main Side windows 2'!$D$17=\"GRP M35\",(IF('main Side windows 2'!$D$13=\"D\",VLOOKUP($C$48,E158:F161,2,-1),0)),0)","v":0}]
[{"$nulls":4},"II",3]
[{"$nulls":4},"III",2]
[{"$nulls":4},"IV",2]
[null,null,"Al 5038","A","I",{"$f":" IF('main Side windows 2'!$D$15>0,3 + 0.05*('main Side windows 2'!$D$15-4),\"\")","v":""},{"$nulls":3},{"$f":"IF('main Side windows 2'!$D$17=\"Al 5038\",(IF('main Side windows 2'!$D$13=\"A\",VLOOKUP($C$48,E162:F165,2,-1),0)),0)","v":0}]
[{"$nulls":4},"II",3]
[{"$nulls":4},"III",3]
[{"$nulls":4},"IV",3]
[null,null,"Al 5038","B","I",{"$f":" IF('main Side windows 2'!$D$15>0,3 + 0.05*('main Side windows 2'!$D$15-4),\"\")","v":""},{"$nulls":3},{"$f":"IF('main Side windows 2'!$D$17=\"AL 5038\",(IF('main Side windows 2'!$D$13=\"B\",VLOOKUP($C$48,E166:F169,2,-1),0)),0)","v":0}]
[{"$nulls":4},"II",3]
[{"$nulls":4},"III",3]
[{"$nulls":4},"IV",3]
[null,null,"Al 5038","C","I",{"$f":" IF('main Side windows 2'!$D$15>0,3 + 0.05*('main Side windows 2'!$D$15-4),\"\")","v":""},{"$nulls":3},{"$f":"IF('main Side windows 2'!$D$17=\"AL 5038\",(IF('main Side windows 2'!$D$13=\"C\",VLOOKUP($C$48,E170:F173,2,-1),0)),0)","v":0}]
[{"$nulls":4},"II",3]
[{"$nulls":4},"III",2]
[{"$nulls":4},"IV",2]
[null,null,"Al 5038","D","I",{"$f":" IF('main Side windows 2'!$D$15>0,3 + 0.05*('main Side windows 2'!$D$15-4),\"\")","v":""},{"$nulls":3},{"$f":"IF('main Side windows 2'!$D$17=\"AL 5038\",(IF('main Side windows 2'!$D$13=\"D\",VLOOKUP($C$48,E174:F177,2,-1),0)),0)","v":0}]
[{"$nulls":4},"II",3]
[{"$nulls":4},"III",2]
[{"$nulls":4},"IV",2]
[null,null,"MS","A","I",{"$f":" IF('main Side windows 2'!$D$15>0,2.5 + 0.025*('main Side windows 2'!$D$15-4),\"\")","v":""},{"$nulls":3},{"$f":"IF('main Side windows 2'!$D$17=\"MS\",(IF('main Side windows 2'!$D$13=\"A\",VLOOKUP($C$48,E178:F181,2,-1),0)),0)","v":0}]
[{"$nulls":4},"II",2.5]
[{"$nulls":4},"III",2.5]
[{"$nulls":4},"IV",2.5]
[null,null,"MS","B","I",{"$f":" IF('main Side windows 2'!$D$15>0,2.5 + 0.025*('main Side windows 2'!$D$15-4),\"\")","v":""},{"$nulls":3},{"$f":"IF('main Side windows 2'!$D$17=\"MS\",(IF('main Side windows 2'!$D$13=\"B\",VLOOKUP($C$48,E182:F185,2,-1),0)),0)","v":0}]
[{"$nulls":4},"II",2.5]
[{"$nulls":4},"III",2.5]
[{"$nulls":4},"IV",2.5]
[null,null,"MS","C","I",{"$f":" IF('main Side windows 2'!$D$15>0,2.5 + 0.025*('main Side windows 2'!$D$15-4),\"\")","v":""},{"$nulls":3},{"$f":"IF('main Side windows 2'!$D$17=\"MS\",(IF('main Side windows 2'!$D$13=\"C\",VLOOKUP($C$48,E186:F189,2,-1),0)),0)","v":0}]
[{"$nulls":4},"II",2.5]
[{"$nulls":4},"III",2]
[{"$nulls":4},"IV",2]
[null,null,"MS","D","I",{"$f":" IF('main Side windows 2'!$D$15>0,2.5 + 0.025*('main Side windows 2'!$D$15-4),\"\")","v":""},{"$nulls":3},{"$f":"IF('main Side windows 2'!$D$17=\"MS\",(IF('main Side windows 2'!$D$13=\"D\",VLOOKUP($C$48,E190:F193,2,-1),0)),0)","v":0}]
[{"$nulls":4},"II",2.5]
[{"$nulls":4},"III",2]
[{"$nulls":4},"IV",2]

{"sheet":"Worksheet 3","index":10,"n_rows":45,"n_cols":31,"rows_kept":45,"merged":[[0,0,0,9],[0,11,0,12],[1,0,1,9],[2,0,2,9],[4,0,4,9],[6,0,6,5],[17,13,17,14],[19,13,19,14],[21,12,21,14],[22,15,26,18],[27,6,28,6],[27,7,28,7],[27,15,27,21],[29,15,32,15],[29,16,32,16],[29,17,32,17],[29,18,29,21],[30,18,30,21],[31,18,31,19],[32,11,32,13],[34,13,34,14],[36,13,36,14],[38,13,38,14],[39,13,39,14],[41,13,41,14]]}
[{"$nulls":11},"Comments"]
["ISO 12216:2020 - Small craft - Windows, portlights, hatches, deadlights and doors",{"$nulls":11},"Derived values"]
["WORKSHEET No. 1 data entry",{"$nulls":11},"Input values"]
[]
[{"$f":"CONCATENATE(coverSheet!B5,\"   \",coverSheet!B12,\"    \",Summary!B11)","v":"       "}]
[]
["Parameter",{"$nulls":5},"Symbol","Unit","Value","Ref.",{"$nulls":5},"Material Properties see table F.1 and Tab. 5",{"$nulls":11},"List"]
["Form of plate (Rectangular / Circle)",{"$nulls":5},"R / C",null,{"$f":"Summary!C11","v":0},"Annex C",{"$nulls":5},"Table F.1 mechanical properties [MPa]",null,null,"Tab. 5",{"$nulls":8},"Lists"]
["Long side",{"$nulls":5},"a","mm",{"$f":"Summary!D11","v":0},"7.3, Annex C",{"$nulls":5},"Material","strength","elasticity","safety",{"$nulls":7},"rectangular","R","I","A",{"$f":"IF(I8=\"rectangular\",\"R\",IF(I8=\"circle\",\"C\",\"\"))","v":""}]
["Unsupported short side",{"$nulls":5},"b","mm",{"$f":"Summary!E11","v":0},"7.3, Annex C",{"$nulls":5},"PMMA",110,3000,3.5,{"$nulls":7},"circle","C","IIa","B"]
["Diameter",{"$nulls":5},"d","mm",{"$f":"Summary!F11","v":0},"7.3, Annex C",{"$nulls":5},"PC",90,2400,3.5,{"$nulls":9},"IIb","C"]
["Curve height",{"$nulls":5},"c","mm",{"$f":"Summary!G11","v":0},"7.6",{"$nulls":5},"TG",200,72600,4,{"$nulls":9},"III","D"]
["Support SemiFixed / Simply Supported",{"$nulls":5},"SF / SS",null,{"$f":"Summary!H11","v":0},"3.18",{"$nulls":5},"CG",300,72600,4,{"$nulls":7},"semi-fixed","SF","IV",null,{"$f":"IF(I13=\"semi-fixed\",\"SF\",IF(I13=\"\",\"\",\"SS\"))","v":"SS"}]
["Location type",{"$nulls":5},"I/IIA/IIB/III/IV",null,{"$f":"Summary!I11","v":0},"3.17; Annex A",{"$nulls":5},"AG",40,72600,4,{"$nulls":7},"simply supported","SS"]
["Location area (only loc. III)",{"$nulls":5},"F / S / Any",null,{"$f":"Summary!J11","v":0},"3.17.4",{"$nulls":5},"AMPW",50,7000,2]
["Design Category",{"$nulls":5},"A / B / C / D",null,{"$f":"Summary!K11","v":0},"3.12",{"$nulls":5},"GRP M30",140,7500,2,{"$nulls":6},"any","front","F","Any","yes",{"$f":"IF(I15=\"front\",\"F\",IF(I15=\"side\",\"S\",IF(I15=\"any\",\"A\",\"\")))","v":""}]
["Craft Type Any/Motor/Sail",{"$nulls":5},"Any / M / S",null,{"$f":"Summary!L11","v":0},{"$nulls":6},"GRP M35",175,10000,2,{"$nulls":6},"motor","side","S","M","no"]
["Length of hull as in ISO 8666",{"$nulls":5},"LH","m",{"$f":"Summary!N11","v":{"v":0,"d":"0.00"}},"3.16",{"$nulls":5},"AL 5038",280,70000,2,{"$nulls":6},"sail","any","Any","S",null,{"$f":"IF(I17=\"any\",\"Any\",IF(I17=\"motor\",\"M\",IF(I17=\"sail\",\"S\",\"\")))","v":""}]
["Material data",{"$nulls":7},{"$f":"Summary!O11","v":0},"Table F.1 & 5",{"$nulls":5},"MS",400,200000,2]
[null,"  Ultimate flexural strength",{"$nulls":4},"σU","MPa",{"$f":"'main Side windows 3'!D18","v":{"$error":"#N/A"}},"Table F.1 & 5",{"$nulls":5},"AISI 316 L",510,200000,2]
[null,"  Modulus of elasticity",{"$nulls":4},"E","MPa",{"$f":"'main Side windows 3'!D19","v":{"$error":"#N/A"}},"Table F.1 & 5"]
[null,"  Safety factor",{"$nulls":4},"gamma",". / .",{"$f":"'main Side windows 3'!D20","v":{"$error":"#N/A"}},"Table F.1 & 5",{"$nulls":15},"yes"]
["Is actual plate a sandwich?",{"$nulls":5},"yes / no",null,{"$f":"Summary!Q11","v":0},"7.9",{"$nulls":5},{"$f":"IF(I23=\"YES\",\"The difference in thickness between any two glass plies must be less than or equal to 2 mm and the thickness of the plastic interlayer must be less than, or equal to 0,76 mm for these conditions !\",\"\")","v":""},{"$nulls":9},"no"]
[null,"If yes, enter number of layers",{"$nulls":5},". / .",{"$f":"Summary!R11","v":0},"7.9"]
["Actual plate thickness (in case of sandwich the sum of all layers)",{"$nulls":6},"mm",{"$f":"Summary!U11","v":{"v":0,"d":"0.00"}}]
[]
["Results for non-stiffened plates"]
["Press reduction factor",{"$nulls":5},"Ψ",". / .",{"$f":"'main Side windows 3'!D23","v":false},"7.5"]
["              within limits 0,33 and 1,0",{"$nulls":7},{"$f":"'main Side windows 3'!D24","v":1},"7.5",{"$nulls":5},"Table 5 — Safety factor and minimum thickness of monolithic plates"]
["Basic design press",{"$nulls":5},"p","kPa",{"$f":"'main Side windows 3'!D25","v":1},"7.4",{"$nulls":5},"Material","Acronym","Safety factor\n γ ","Minimum thickness of monolithic plates, tm"]
["Allowable flexural stress",{"$nulls":5},"σa","MPa",{"$f":"'main Side windows 3'!D26","v":{"$error":"#N/A"}},"7.8",{"$nulls":8},"Design categories "]
["Curvature coefficient",{"$nulls":5},"kC",". / .",{"$f":"'main Side windows 3'!D27","v":{"$error":"#DIV/0!"}},"7.6",{"$nulls":8},"Any",null,"A & B","C & D"]
["Ratio a/b (valid ≤ 5)",{"$nulls":6},". / .",{"$f":"'main Side windows 3'!D28","v":{"$error":"#DIV/0!"}},"7.3, Annex G.2",{"$nulls":8},"Area Ia","Area II","Area III & IV","Area III & IV"]
["Ratio a/b corrected",{"$nulls":6},". / .",{"$f":"'main Side windows 3'!D29","v":{"$error":"#DIV/0!"}},"7.3, Annex G.2",{"$nulls":5},"Poly(methyl)methacrylate","PMMA",3.5,"6+0,1(LH-4)",6,5,4]
["Plate aspect ratio coeff stress",{"$nulls":5},"kr",". / .",{"$f":"'main Side windows 3'!D30","v":"FALSCH"},"7.3, Annex G.2",{"$nulls":5},"Polycarbonate","PC",3.5,"6+0,1(LH-4)",6,5,4]
["Pate aspect ratio coeff deflection",{"$nulls":5},"kf",". / .",{"$f":"'main Side windows 3'!D31","v":false},"7.3, Annex G.2",{"$nulls":5},"Monolithic tempered glass ","TG",4,"5+0,1(LH-4)b",4,4,3]
[{"$nulls":15},"Laminated glass ","LG",4,"5+0,1(LH-4)b",4,4,3]
["Thickness (Stress)",{"$nulls":5},"tr","mm",{"$f":"'main Side windows 3'!D33","v":{"$error":"#DIV/0!"}},"7.1.1",{"$nulls":5},"All mahogany plywood ","AMPW",2,"8+0,1(LH-4)",6,5,4]
["Thickness (Deflection)",{"$nulls":5},"tf","mm",{"$f":"'main Side windows 3'!D34","v":{"$error":"#DIV/0!"}},"7.1.2",{"$nulls":5},"GRP mat 30 % glass ","GRP M30",2,"4+0,1(LH-4)",3,3,2]
["Thickness",{"$nulls":6},"mm",{"$f":"'main Side windows 3'!D35","v":{"$error":"#DIV/0!"}},{"$nulls":6},"GRP mat/roving 35 % glass ","GRP M35",2,"4+0,1(LH-4)",3,3,2]
["Thickness minimu, techn. ",{"$nulls":5},"tm","mm",{"$f":"'main Side windows 3'!D36","v":{"$error":"#DIV/0!"}},"7.8",{"$nulls":5},"Aluminium alloy 5083-H111 ","AL 5038",2,"3+0,05 (LH-4)",3,3,2]
["Thickness minimum, Tab 5",{"$nulls":6},"mm",{"$f":"'main Side windows 3'!D37","v":{"v":0,"d":"0.0"}},"Table 5",{"$nulls":5},"Mild steel ","MS",2,"2,5+0,025 (LH-4)",2.5,2.5,2]
[]
["Required plate thickness",{"$nulls":6},"mm",{"$f":"'main Side windows 3'!I31","v":{"$error":"#DIV/0!"}}]
["Requirements fullfilled?",{"$nulls":7},{"$f":"IF(L13=\"short side in area I max 300mm\",\"FAIL\",IF(I25>=I44,\"PASS\",\"FAIL\"))","v":{"$error":"#DIV/0!"}}]

{"sheet":"main Side windows 3","index":11,"n_rows":43,"n_cols":24,"rows_kept":43,"hidden":true,"merged":[[0,0,0,5],[1,0,1,5],[25,11,28,18],[26,6,26,7]]}
[{"$nulls":6},"manufacturer"]
[{"$nulls":6},"model name"]
["Eingabe","Version 1.2.2 / 15-03-2006 rev 060512/070507/dew 090918",{"$nulls":4},"ISO/FDIS 12216:2002(E)"]
["Parameter Input","SSign","Item/Unit",{"$nulls":18},"Lists"]
["form of plate Rectangular/Circle",null,"R/C",{"$f":"'Worksheet 3'!AE9","v":""},{"$f":"IF(D5=\"\",\"Input R oder C\",\"\")","v":"Input R oder C"},null,"Material Properties see table F.1 and Tab. 5",{"$nulls":14},"R","I","A"]
["long side","a","mm",{"$f":"'Worksheet 3'!I9","v":0},{"$f":"IF(AND(D5=\"R\",D6=\"\"),\"Input a requested\",IF(AND(D5=\"C\",D6=\"\"),\"Input d requested\",\"\"))","v":""},null,"Table F.1 mechanical properties [Mpa]",null,null,"Tab. 5",{"$nulls":11},"C","IIa","B"]
["unsupported short side","b","mm",{"$f":"'Worksheet 3'!I10","v":0},{"$f":"IF(AND(D5=\"R\",D7=\"\"),\"Input b requested\",IF(AND(D5=\"C\",D7=\"\"),\"Input d requested\",\"\"))","v":""},null,"Material","strength","elasticity","safety",{"$nulls":12},"IIb","C"]
["diameter","d","mm",{"$f":"'Worksheet 3'!I11","v":0},{"$f":"IF(AND(D5=\"C\",D8=\"\"),\"Input d requested\",\"\")","v":""},null,"PMMA",110,3000,3.5,{"$nulls":3},"AG",40,72600,4,{"$nulls":5},"III","D"]
["curve height","c","mm",{"$f":"'Worksheet 3'!I12","v":0},"optional",null,"PC",90,2400,3.5,{"$nulls":3},"AISI 316 L",510,200000,2,{"$nulls":4},"SF","IV"]
["support SemiFixed/Simple Supp.",null,"SF/SS",{"$f":"'Worksheet 3'!AE13","v":"SS"},{"$f":"IF(D10=\"\",\"Input SF or SS\",\"\")","v":""},null,"TG",200,72600,4,null,null,"6.1","AL 5038",280,70000,2,{"$nulls":4},"SS"]
["Location type",null,"I/IIA/IIB/III/IV",{"$f":"'Worksheet 3'!I14","v":{"v":0,"d":"0.00"}},{"$f":"IF(D11=\"\",\"Input I / IIa,b / III / IV\",\"\")","v":""},null,"CG",300,72600,4,null,null,"3.17.1-4","AMPW",50,7000,2]
["Location area (only loc. III)",null,"F/S/A",{"$f":"'Worksheet 3'!AE16","v":""},{"$f":"IF(D12=\"F\",\"\",IF(D12=\"S\",\"\",IF(D12=\"A\",\"\",IF(D11=\"III\",\"Input F / S / A\",\"\"))))","v":""},null,"AG",40,72600,4,{"$nulls":3},"CG",300,72600,4,{"$nulls":4},"F","Any","yes"]
["Design Category",null,"A/B/C/D",{"$f":"IF('Worksheet 3'!I16=\"\",\"\",'Worksheet 3'!I16)","v":{"v":0,"d":"0.00"}},{"$f":"IF(D13=\"\",\"Input A / B / C / D\",\"\")","v":""},null,"AMPW",50,7000,2,{"$nulls":3},"GRP M30",140,7500,2,{"$nulls":4},"S","M","no"]
["Craft Type Any/Motor/Sail",null,"Any/M/S",{"$f":"'Worksheet 3'!AE18","v":""},{"$f":"IF(D14=\"\",\"Input Any / M / S\",\"\")","v":"Input Any / M / S"},null,"GRP M30",140,7500,2,{"$nulls":3},"GRP M35",175,10000,2,{"$nulls":4},"A","S"]
["optional: craft length of hull",null,"m",{"$f":"'Worksheet 3'!I18","v":{"v":0,"d":"0.00"}},"default, change if smaller",null,"GRP M35",175,10000,2,{"$nulls":3},"MS",400,200000,2]
[{"$nulls":6},"AL 5038",280,70000,2,{"$nulls":3},"PC",90,2400,3.5]
["Material",null,"see Tab. F.1",{"$f":"'Worksheet 3'!I19","v":{"v":0,"d":"0.00"}},{"$f":"IF(D17=\"\",\"manual input requ\",\"\")","v":""},null,"MS",400,200000,2,{"$nulls":3},"PMMA",110,3000,3.5]
["  ultimate flexural strength","Sigma u",null,{"$f":"LOOKUP(D17,N8:N18,O8:O18)","v":{"$error":"#N/A"}},"falls nicht in F.1 ",null,"AISI 316 L",510,200000,2,{"$nulls":3},"TG",200,72600,4]
["  modulus of elasticity","E",null,{"$f":"LOOKUP(D17,N8:N18,P8:P18)","v":{"$error":"#N/A"}},"Werte manuell"]
["  safety factor","gamma",null,{"$f":"LOOKUP(D17,N8:N18,Q8:Q18)","v":{"$error":"#N/A"}},"eintragen"]
[]
["Results for non-stiffened plates"]
["press reduction factor",null,null,{"$f":"IF(D5=\"R\",1.102-0.0004*D7,IF(D5=\"C\",1.102-0.0004*D8))","v":false},"(7.5)"]
["              within limits 0,33 and 1,0","psi",null,{"$f":"IF(D23<0.33,0.33,IF(D23>1,1,D23))","v":{"v":1,"d":"1.000"}},"(7.5)"]
["basic design press","p","KPa",{"$f":"'basic design pressure 3'!G43","v":{"v":1,"d":"1.00"}},"(7.4)",null,"see work sheet \"basic design press\""]
["allowable flexural stress","Sigma a","MPa",{"$f":"D18/D20","v":{"$error":"#N/A"}},"(7.8)",null,"is actual plate a sandwich?",null,{"$f":"'Worksheet 3'!I23","v":0},null,null,{"$f":"IF(I26=\"YES\",\"the difference in thickness between any two glass plies must be less than or equal to 2 mm and the thickness of the plastic interlayer must be less than, or equal to 0,76 mm for these conditions !\",\"\")","v":""}]
["curvature coefficient","kc",null,{"$f":"IF(D5=\"C\",1-(D9/D8),1-(D9/D7))","v":{"$error":"#DIV/0!"}},"(7.6)",null,{"$f":"IF(I26=\"yes\", \"number of layers?\",\"\")","v":""},null,{"$f":"IF('Worksheet 3'!I24=\"\",\"\",'Worksheet 3'!I24)","v":0}]
["              a/b real  (valid ≤ 5)",null,null,{"$f":"IF(D5=\"C\",1,D6/D7)","v":{"$error":"#DIV/0!"}},"(7.3) Annex G.2"]
["              a/b corrected",null,null,{"$f":"IF(D28>5,5,D28)","v":{"$error":"#DIV/0!"}},"(7.3) Annex G.2"]
["plate aspect ratio coeff stress","kr",null,{"$f":"IF(D5=\"R\",IF(D10=\"SF\",(0.62165*D29^2-0.6473*D29+0.26481)/(D29^2-1.173*D29+0.97671),IF(D10=\"SS\",(0.69952*D29^2+0.02662*D29-0.0735)/(D29^2-0.7185*D29+1.98925),\"Fehler\")),IF(D5=\"C\",IF(D10=\"SF\",0.248,0.309),\"FALSCH\"))","v":"FALSCH"},"(7.3) Annex G.2",null,"actual plate Thickness",null,{"$f":"'Worksheet 3'!I25","v":0},"mm",null,{"$f":"IF(I26=\"yes\", \"=sum of all plies\",\"\")","v":""}]
["pate aspect ratio coeff deflection","kf",null,{"$f":"IF(D5=\"R\",IF(D10=\"SF\",(0.08052*D29^2-0.0272*D29-0.0019)/(D29^2-0.9275*D29+1.70018),IF(D10=\"SS\",(0.12915*D29^2+0.00868*D29-0.0293)/(D29^2-0.887*D29+2.3372),\"Fehler\")),IF(D5=\"C\",IF(D10=\"SF\",0.027,0.043)))","v":false},"(7.3) Annex G.2",null,"required plate thickness",null,{"$f":"IF(AND(I26=\"Yes\",I27=\"\"),\"please enter number of layers\",IF(AND(I26=\"Yes\",I27>2),1.5*MAX(D35:D37),IF(AND(I26=\"Yes\",I27=2),1.2*MAX(D35:D37),IF(I36=\"Yes\",MAX(D36:D37),MAX(D35:D37)))))","v":{"$error":"#DIV/0!"}}]
[{"$nulls":6},"requirements fulfilled?",null,{"$f":"IF(I30=\"\",\"\",IF(I30>=I31,\"PASS\",\"FAIL\"))","v":{"$error":"#DIV/0!"}}]
["Thickness (Stress)","tr","mm",{"$f":"IF(D5=\"C\",D8*D27*SQRT(D30*D24*D25/D26/1000),D7*D27*SQRT(D30*D24*D25/D26/1000))","v":{"$error":"#DIV/0!"}},"(7.1.1)"]
["Thickness (Deflection)","tf","mm",{"$f":"0.45*(D33+D7*D27*POWER((D31*D24*D25/0.02/D19/1000),0.33333))","v":{"$error":"#DIV/0!"}},"(7.1.2)"]
["Thickness",null,null,{"$f":"ROUND(MAX(D33:D34),2)","v":{"$error":"#DIV/0!"}},"(7.1.7)",{"$nulls":3},"Minimum tech used???"]
["Thickness minimu, techn. ",null,"mm",{"$f":"D35-0.5","v":{"$error":"#DIV/0!"}},null,null," = Minimum, absolute",null,{"$f":"Summary!P11","v":0}]
["Thickness minimum, Tab 5","tm","mm",{"$f":"'basic design pressure 3'!J48","v":{"v":0,"d":"0.0"}},"(Tab. 5)",null,"(only PMMA, PC, TG, LG)"]
[]
["Escape Hatch possible ?"]
["Required ISO 9094-1, 2"]
["Circular: inner Diam > 450 mm",null,null,{"$f":"IF(D5=\"C\",IF(D8>450,\"pass\",\"fail\"),\"n.a.\")","v":"n.a."}]
["Rectang: inner Diam > 380 mm",null,null,{"$f":"IF(D5=\"R\",IF(MAX(D6:D7)>380,\"pass\",\"fail\"),\"n.a.\")","v":"n.a."}]
["              Area > 180000 mm²",null,null,{"$f":"IF(D5=\"R\",IF(D6*D7>180000,\"pass\",\"fail\"),\"n.a.\")","v":"n.a."}]

{"sheet":"basic design pressure 3","index":12,"n_rows":193,"n_cols":10,"rows_kept":193,"hidden":true}
["Basic design pressure",null,null,"(7.4 Table 4)"]
[]
["location",null,{"$f":"'main Side windows 3'!D11","v":0}]
["particular",null,{"$f":"IF(AND(C5=\"C\",C6=\"M\",C3=\"III\"),\"A\",'main Side windows 3'!D12)","v":""},null,"Remark: f=front, s=side"]
["design cat",null,{"$f":"'main Side windows 3'!D13","v":0}]
["craft type",null,{"$f":"'main Side windows 3'!D14","v":""},{"$f":"IF(C6=\"Any\",\"S\",C6)","v":""},"Remark: if craft type = Any, set craft type = S"]
[]
[]
["Tabelle 4",null,"location","craft type","design cat","particular","pressure"]
[null,null,"I","Any","Any","Any",70]
[null,null,"IIB","Any","A","Any",70]
[null,null,"IIB","Any","B","Any",50]
[null,null,"IIB","Any","C","Any",28]
[null,null,"IIB","Any","D","Any",28]
[null,null,"IIA","Any","Any","Any",28]
[null,null,"III","S","A","Any",18]
[null,null,"III","S","B","Any",18]
[null,null,"III","S","C","Any",12]
[null,null,"III","S","D","Any",12]
[null,null,"III","M","A","Front",12]
[null,null,"III","M","A","Any",12]
[null,null,"III","M","B","Front",9]
[null,null,"III","M","B","Any",9]
[null,null,"III","M","D","Front",6,null,null,"Korrektur, Zeile eingefügt um Fehler bei eingabe III, M, Front, D zu beheben"]
[null,null,"III","M","A","Side",9]
[null,null,"III","M","B","Side",6]
[null,null,"III","M","C","Any",6]
[null,null,"III","M","D","Any",6]
[null,null,"IV","S","Any","Any",12]
[null,null,"IV","M","Any","Any",6]
[]
["Ergebnis"]
[null,"location = I",{"$nulls":4},{"$f":"IF(C3=\"I\",G10,0)","v":0}]
[null,"location = IIB",{"$nulls":4},{"$f":"IF(C3=\"IIB\",VLOOKUP(C5,E11:G15,3),0)","v":0}]
[null,"location = IIA",{"$nulls":4},{"$f":"IF(C3=\"IIA\",VLOOKUP(C3,E11:G15,3),0)","v":0}]
[null,"location = III","craft = S",{"$nulls":3},{"$f":"IF(AND(C3=\"III\",D6=\"S\"),VLOOKUP(C5,E16:G19,3),0)","v":0}]
[null,"location = III","craft = M","particular = front",null,null,{"$f":"IF(AND(C3=\"III\",D6=\"M\",C4=\"F\"),VLOOKUP(C5,E20:G24,3),0)","v":0}]
[null,"location = III","craft = M","particular = any",null,null,{"$f":"IF(AND(OR(C5=\"A\",C5=\"B\"),C3=\"III\",D6=\"M\",C4=\"A\"),VLOOKUP(C5,E20:G24,3),0)","v":0}]
[null,"location = III","craft = M","particular = side",null,null,{"$f":"IF(AND(C3=\"III\",C6=\"M\",C4=\"S\"),IF(C5=\"A\",9,IF(C5=\"B\",6,0)))","v":false}]
[null,"location = III","craft = M",{"$nulls":3},{"$f":"IF(C5=\"A\",0,IF(C5=\"B\",0,IF(AND(C3=\"III\",C6=\"M\"),VLOOKUP(C5,E27:G28,3))))","v":false}]
[null,"location = IV",{"$nulls":4},{"$f":"IF(C3=\"IV\",VLOOKUP(D6,D29:G30,4,0),1)","v":1}]
[]
["pressure",{"$nulls":5},{"$f":"MAX(G33:G41)","v":1}]
[]
[]
["minimum thickness"]
[]
[null,"Area",{"$f":"IF(OR('main Side windows 3'!D11=\"IIA\",'main Side windows 3'!D11=\"IIB\"),\"II\",'main Side windows 3'!D11)","v":0},{"$nulls":4},"minimum thickness",null,{"$f":"MAX(J50:J190)","v":0}]
[]
[null,null,"PMMA","A","I",{"$f":" IF('main Side windows 3'!$D$15>0,6 + 0.1*('main Side windows 3'!$D$15-4),\"\")","v":""},{"$nulls":3},{"$f":"IF('main Side windows 3'!$D$17=\"PMMA\",(IF('main Side windows 3'!$D$13=\"A\",VLOOKUP($C$48,$E$50:$F$53,2,-1),0)),0)","v":0}]
["Table 5",{"$nulls":3},"II",6]
[{"$nulls":4},"III",5]
[{"$nulls":4},"IV",5]
[null,null,"PMMA","B","I",{"$f":" IF('main Side windows 3'!$D$15>0,6 + 0.1*('main Side windows 3'!$D$15-4),\"\")","v":""},{"$nulls":3},{"$f":"IF('main Side windows 3'!$D$17=\"PMMA\",(IF('main Side windows 3'!$D$13=\"B\",VLOOKUP($C$48,$E$54:$F$57,2,-1),0)),0)","v":0}]
[{"$nulls":4},"II",6]
[{"$nulls":4},"III",5]
[{"$nulls":4},"IV",5]
[null,null,"PMMA","C","I",{"$f":" IF('main Side windows 3'!$D$15>0,6 + 0.1*('main Side windows 3'!$D$15-4),\"\")","v":""},{"$nulls":3},{"$f":"IF('main Side windows 3'!$D$17=\"PMMA\",(IF('main Side windows 3'!$D$13=\"C\",VLOOKUP($C$48,$E$58:$F$61,2,-1),0)),0)","v":0}]
[{"$nulls":4},"II",6]
[{"$nulls":4},"III",4]
[{"$nulls":4},"IV",4]
[null,null,"PMMA","D","I",{"$f":" IF('main Side windows 3'!$D$15>0,6 + 0.1*('main Side windows 3'!$D$15-4),\"\")","v":""},{"$nulls":3},{"$f":"IF('main Side windows 3'!$D$17=\"PMMA\",(IF('main Side windows 3'!$D$13=\"D\",VLOOKUP($C$48,E62:F65,2,-1),0)),0)","v":0}]
[{"$nulls":4},"II",6]
[{"$nulls":4},"III",4]
[{"$nulls":4},"IV",4]
[null,null,"PC","A","I",{"$f":" IF('main Side windows 3'!$D$15>0,6 + 0.1*('main Side windows 3'!$D$15-4),\"\")","v":""},{"$nulls":3},{"$f":"IF('main Side windows 3'!$D$17=\"PC\",(IF('main Side windows 3'!$D$13=\"A\",VLOOKUP($C$48,E66:F69,2,-1),0)),0)","v":0}]
[{"$nulls":4},"II",6]
[{"$nulls":4},"III",5]
[{"$nulls":4},"IV",5]
[null,null,"PC","B","I",{"$f":" IF('main Side windows 3'!$D$15>0,6 + 0.1*('main Side windows 3'!$D$15-4),\"\")","v":""},{"$nulls":3},{"$f":"IF('main Side windows 3'!$D$17=\"PC\",(IF('main Side windows 3'!$D$13=\"B\",VLOOKUP($C$48,E70:F73,2,-1),0)),0)","v":0}]
[{"$nulls":4},"II",6]
[{"$nulls":4},"III",5]
[{"$nulls":4},"IV",5]
[null,null,"PC","C","I",{"$f":" IF('main Side windows 3'!$D$15>0,6 + 0.1*('main Side windows 3'!$D$15-4),\"\")","v":""},{"$nulls":3},{"$f":"IF('main Side windows 3'!$D$17=\"PC\",(IF('main Side windows 3'!$D$13=\"C\",VLOOKUP($C$48,E74:F77,2,-1),0)),0)","v":0}]
[{"$nulls":4},"II",6]
[{"$nulls":4},"III",4]
[{"$nulls":4},"IV",4]
[null,null,"PC","D","I",{"$f":" IF('main Side windows 3'!$D$15>0,6 + 0.1*('main Side windows 3'!$D$15-4),\"\")","v":""},{"$nulls":3},{"$f":"IF('main Side windows 3'!$D$17=\"PC\",(IF('main Side windows 3'!$D$13=\"D\",VLOOKUP($C$48,E78:F81,2,-1),0)),0)","v":0}]
[{"$nulls":4},"II",6]
[{"$nulls":4},"III",4]
[{"$nulls":4},"IV",4]
[null,null,"TG","A","I",{"$f":" IF('main Side windows 3'!$D$15>0,5+ 0.1*('main Side windows 3'!$D$15-4),\"\")","v":""},{"$nulls":3},{"$f":"IF('main Side windows 3'!$D$17=\"TG\",(IF('main Side windows 3'!$D$13=\"A\",VLOOKUP($C$48,E82:F85,2,-1),0)),0)","v":0}]
[{"$nulls":4},"II",4]
[{"$nulls":4},"III",4]
[{"$nulls":4},"IV",4]
[null,null,"TG","B","I",{"$f":" IF('main Side windows 3'!$D$15>0,5+ 0.1*('main Side windows 3'!$D$15-4),\"\")","v":""},{"$nulls":3},{"$f":"IF('main Side windows 3'!$D$17=\"TG\",(IF('main Side windows 3'!$D$13=\"B\",VLOOKUP($C$48,E86:F89,2,-1),0)),0)","v":0}]
[{"$nulls":4},"II",4]
[{"$nulls":4},"III",4]
[{"$nulls":4},"IV",4]
[null,null,"TG","C","I",{"$f":" IF('main Side windows 3'!$D$15>0,5+ 0.1*('main Side windows 3'!$D$15-4),\"\")","v":""},{"$nulls":3},{"$f":"IF('main Side windows 3'!$D$17=\"TG\",(IF('main Side windows 3'!$D$13=\"C\",VLOOKUP($C$48,E90:F93,2,-1),0)),0)","v":0}]
[{"$nulls":4},"II",4]
[{"$nulls":4},"III",3]
[{"$nulls":4},"IV",3]
[null,null,"TG","D","I",{"$f":" IF('main Side windows 3'!$D$15>0,5+ 0.1*('main Side windows 3'!$D$15-4),\"\")","v":""},{"$nulls":3},{"$f":"IF('main Side windows 3'!$D$17=\"TG\",(IF('main Side windows 3'!$D$13=\"D\",VLOOKUP($C$48,E94:F97,2,-1),0)),0)","v":0}]
[{"$nulls":4},"II",4]
[{"$nulls":4},"III",3]
[{"$nulls":4},"IV",3]
[null,null,"LG","A","I",{"$f":" IF('main Side windows 3'!$D$15>0,5+ 0.1*('main Side windows 3'!$D$15-4),\"\")","v":""},{"$nulls":3},{"$f":"IF('main Side windows 3'!$D$17=\"LG\",(IF('main Side windows 3'!$D$13=\"A\",VLOOKUP($C$48,E98:F101,2,-1),0)),0)","v":0}]
[{"$nulls":4},"II",4]
[{"$nulls":4},"III",4]
[{"$nulls":4},"IV",4]
[null,null,"LG","B","I",{"$f":" IF('main Side windows 3'!$D$15>0,5+ 0.1*('main Side windows 3'!$D$15-4),\"\")","v":""},{"$nulls":3},{"$f":"IF('main Side windows 3'!$D$17=\"LG\",(IF('main Side windows 3'!$D$13=\"B\",VLOOKUP($C$48,E102:F105,2,-1),0)),0)","v":0}]
[{"$nulls":4},"II",4]
[{"$nulls":4},"III",4]
[{"$nulls":4},"IV",4]
[null,null,"LG","C","I",{"$f":" IF('main Side windows 3'!$D$15>0,5+ 0.1*('main Side windows 3'!$D$15-4),\"\")","v":""},{"$nulls":3},{"$f":"IF('main Side windows 3'!$D$17=\"LG\",(IF('main Side windows 3'!$D$13=\"C\",VLOOKUP($C$48,E106:F109,2,-1),0)),0)","v":0}]
[{"$nulls":4},"II",4]
[{"$nulls":4},"III",3]
[{"$nulls":4},"IV",3]
[null,null,"LG","D","I",{"$f":" IF('main Side windows 3'!$D$15>0,5+ 0.1*('main Side windows 3'!$D$15-4),\"\")","v":""},{"$nulls":3},{"$f":"IF('main Side windows 3'!$D$17=\"LG\",(IF('main Side windows 3'!$D$13=\"D\",VLOOKUP($C$48,E110:F113,2,-1),0)),0)","v":0}]
[{"$nulls":4},"II",4]
[{"$nulls":4},"III",3]
[{"$nulls":4},"IV",3]
[null,null,"AMPW","A","I",{"$f":" IF('main Side windows 3'!$D$15>0,8+ 0.1*('main Side windows 3'!$D$15-4),\"\")","v":""},{"$nulls":3},{"$f":"IF('main Side windows 3'!$D$17=\"AMPW\",(IF('main Side windows 3'!$D$13=\"A\",VLOOKUP($C$48,E114:F117,2,-1),0)),0)","v":0}]
[{"$nulls":4},"II",6]
[{"$nulls":4},"III",5]
[{"$nulls":4},"IV",5]
[null,null,"AMPW","B","I",{"$f":" IF('main Side windows 3'!$D$15>0,8+ 0.1*('main Side windows 3'!$D$15-4),\"\")","v":""},{"$nulls":3},{"$f":"IF('main Side windows 3'!$D$17=\"AMPW\",(IF('main Side windows 3'!$D$13=\"B\",VLOOKUP($C$48,E118:F121,2,-1),0)),0)","v":0}]
[{"$nulls":4},"II",6]
[{"$nulls":4},"III",5]
[{"$nulls":4},"IV",5]
[null,null,"AMPW","C","I",{"$f":" IF('main Side windows 3'!$D$15>0,8+ 0.1*('main Side windows 3'!$D$15-4),\"\")","v":""},{"$nulls":3},{"$f":"IF('main Side windows 3'!$D$17=\"AMPW\",(IF('main Side windows 3'!$D$13=\"C\",VLOOKUP($C$48,E122:F125,2,-1),0)),0)","v":0}]
[{"$nulls":4},"II",6]
[{"$nulls":4},"III",4]
[{"$nulls":4},"IV",4]
[null,null,"AMPW","D","I",{"$f":" IF('main Side windows 3'!$D$15>0,8+ 0.1*('main Side windows 3'!$D$15-4),\"\")","v":""},{"$nulls":3},{"$f":"IF('main Side windows 3'!$D$17=\"AMPW\",(IF('main Side windows 3'!$D$13=\"D\",VLOOKUP($C$48,E126:F129,2,-1),0)),0)","v":0}]
[{"$nulls":4},"II",6]
[{"$nulls":4},"III",4]
[{"$nulls":4},"IV",4]
[null,null,"GRP m30","A","I",{"$f":" IF('main Side windows 3'!$D$15>0,4 + 0.1*('main Side windows 3'!$D$15-4),\"\")","v":""},{"$nulls":3},{"$f":"IF('main Side windows 3'!$D$17=\"GRP M30\",(IF('main Side windows 3'!$D$13=\"A\",VLOOKUP($C$48,E130:F133,2,-1),0)),0)","v":0}]
[{"$nulls":4},"II",3]
[{"$nulls":4},"III",3]
[{"$nulls":4},"IV",3]
[null,null,"GRP m30","B","I",{"$f":" IF('main Side windows 3'!$D$15>0,4 + 0.1*('main Side windows 3'!$D$15-4),\"\")","v":""},{"$nulls":3},{"$f":"IF('main Side windows 3'!$D$17=\"GRP M30\",(IF('main Side windows 3'!$D$13=\"B\",VLOOKUP($C$48,E134:F137,2,-1),0)),0)","v":0}]
[{"$nulls":4},"II",3]
[{"$nulls":4},"III",3]
[{"$nulls":4},"IV",3]
[null,null,"GRP m30","C","I",{"$f":" IF('main Side windows 3'!$D$15>0,4 + 0.1*('main Side windows 3'!$D$15-4),\"\")","v":""},{"$nulls":3},{"$f":"IF('main Side windows 3'!$D$17=\"GRP M30\",(IF('main Side windows 3'!$D$13=\"C\",VLOOKUP($C$48,E138:F141,2,-1),0)),0)","v":0}]
[{"$nulls":4},"II",3]
[{"$nulls":4},"III",2]
[{"$nulls":4},"IV",2]
[null,null,"GRP m30","D","I",{"$f":" IF('main Side windows 3'!$D$15>0,4 + 0.1*('main Side windows 3'!$D$15-4),\"\")","v":""},{"$nulls":3},{"$f":"IF('main Side windows 3'!$D$17=\"GRP M30\",(IF('main Side windows 3'!$D$13=\"D\",VLOOKUP($C$48,E142:F145,2,-1),0)),0)","v":0}]
[{"$nulls":4},"II",3]
[{"$nulls":4},"III",2]
[{"$nulls":4},"IV",2]
[null,null,"GRP m35","A","I",{"$f":" IF('main Side windows 3'!$D$15>0,4 + 0.1*('main Side windows 3'!$D$15-4),\"\")","v":""},{"$nulls":3},{"$f":"IF('main Side windows 3'!$D$17=\"GRP M35\",(IF('main Side windows 3'!$D$13=\"A\",VLOOKUP($C$48,E146:F149,2,-1),0)),0)","v":0}]
[{"$nulls":4},"II",3]
[{"$nulls":4},"III",3]
[{"$nulls":4},"IV",3]
[null,null,"GRP m35","B","I",{"$f":" IF('main Side windows 3'!$D$15>0,4 + 0.1*('main Side windows 3'!$D$15-4),\"\")","v":""},{"$nulls":3},{"$f":"IF('main Side windows 3'!$D$17=\"GRP M35\",(IF('main Side windows 3'!$D$13=\"B\",VLOOKUP($C$48,E150:F153,2,-1),0)),0)","v":0}]
[{"$nulls":4},"II",3]
[{"$nulls":4},"III",3]
[{"$nulls":4},"IV",3]
[null,null,"GRP m35","C","I",{"$f":" IF('main Side windows 3'!$D$15>0,4 + 0.1*('main Side windows 3'!$D$15-4),\"\")","v":""},{"$nulls":3},{"$f":"IF('main Side windows 3'!$D$17=\"GRP M35\",(IF('main Side windows 3'!$D$13=\"C\",VLOOKUP($C$48,E154:F157,2,-1),0)),0)","v":0}]
[{"$nulls":4},"II",3]
[{"$nulls":4},"III",2]
[{"$nulls":4},"IV",2]
[null,null,"GRP m35","D","I",{"$f":" IF('main Side windows 3'!$D$15>0,4 + 0.1*('main Side windows 3'!$D$15-4),\"\")","v":""},{"$nulls":3},{"$f":"IF('main Side windows 3'!$D$17=\"GRP M35\",(IF('main Side windows 3'!$D$13=\"D\",VLOOKUP($C$48,E158:F161,2,-1),0)),0)","v":0}]
[{"$nulls":4},"II",3]
[{"$nulls":4},"III",2]
[{"$nulls":4},"IV",2]
[null,null,"Al 5038","A","I",{"$f":" IF('main Side windows 3'!$D$15>0,3 + 0.05*('main Side windows 3'!$D$15-4),\"\")","v":""},{"$nulls":3},{"$f":"IF('main Side windows 3'!$D$17=\"Al 5038\",(IF('main Side windows 3'!$D$13=\"A\",VLOOKUP($C$48,E162:F165,2,-1),0)),0)","v":0}]
[{"$nulls":4},"II",3]
[{"$nulls":4},"III",3]
[{"$nulls":4},"IV",3]
[null,null,"Al 5038","B","I",{"$f":" IF('main Side windows 3'!$D$15>0,3 + 0.05*('main Side windows 3'!$D$15-4),\"\")","v":""},{"$nulls":3},{"$f":"IF('main Side windows 3'!$D$17=\"AL 5038\",(IF('main Side windows 3'!$D$13=\"B\",VLOOKUP($C$48,E166:F169,2,-1),0)),0)","v":0}]
[{"$nulls":4},"II",3]
[{"$nulls":4},"III",3]
[{"$nulls":4},"IV",3]
[null,null,"Al 5038","C","I",{"$f":" IF('main Side windows 3'!$D$15>0,3 + 0.05*('main Side windows 3'!$D$15-4),\"\")","v":""},{"$nulls":3},{"$f":"IF('main Side windows 3'!$D$17=\"AL 5038\",(IF('main Side windows 3'!$D$13=\"C\",VLOOKUP($C$48,E170:F173,2,-1),0)),0)","v":0}]
[{"$nulls":4},"II",3]
[{"$nulls":4},"III",2]
[{"$nulls":4},"IV",2]
[null,null,"Al 5038","D","I",{"$f":" IF('main Side windows 3'!$D$15>0,3 + 0.05*('main Side windows 3'!$D$15-4),\"\")","v":""},{"$nulls":3},{"$f":"IF('main Side windows 3'!$D$17=\"AL 5038\",(IF('main Side windows 3'!$D$13=\"D\",VLOOKUP($C$48,E174:F177,2,-1),0)),0)","v":0}]
[{"$nulls":4},"II",3]
[{"$nulls":4},"III",2]
[{"$nulls":4},"IV",2]
[null,null,"MS","A","I",{"$f":" IF('main Side windows 3'!$D$15>0,2.5 + 0.025*('main Side windows 3'!$D$15-4),\"\")","v":""},{"$nulls":3},{"$f":"IF('main Side windows 3'!$D$17=\"MS\",(IF('main Side windows 3'!$D$13=\"A\",VLOOKUP($C$48,E178:F181,2,-1),0)),0)","v":0}]
[{"$nulls":4},"II",2.5]
[{"$nulls":4},"III",2.5]
[{"$nulls":4},"IV",2.5]
[null,null,"MS","B","I",{"$f":" IF('main Side windows 3'!$D$15>0,2.5 + 0.025*('main Side windows 3'!$D$15-4),\"\")","v":""},{"$nulls":3},{"$f":"IF('main Side windows 3'!$D$17=\"MS\",(IF('main Side windows 3'!$D$13=\"B\",VLOOKUP($C$48,E182:F185,2,-1),0)),0)","v":0}]
[{"$nulls":4},"II",2.5]
[{"$nulls":4},"III",2.5]
[{"$nulls":4},"IV",2.5]
[null,null,"MS","C","I",{"$f":" IF('main Side windows 3'!$D$15>0,2.5 + 0.025*('main Side windows 3'!$D$15-4),\"\")","v":""},{"$nulls":3},{"$f":"IF('main Side windows 3'!$D$17=\"MS\",(IF('main Side windows 3'!$D$13=\"C\",VLOOKUP($C$48,E186:F189,2,-1),0)),0)","v":0}]
[{"$nulls":4},"II",2.5]
[{"$nulls":4},"III",2]
[{"$nulls":4},"IV",2]
[null,null,"MS","D","I",{"$f":" IF('main Side windows 3'!$D$15>0,2.5 + 0.025*('main Side windows 3'!$D$15-4),\"\")","v":""},{"$nulls":3},{"$f":"IF('main Side windows 3'!$D$17=\"MS\",(IF('main Side windows 3'!$D$13=\"D\",VLOOKUP($C$48,E190:F193,2,-1),0)),0)","v":0}]
[{"$nulls":4},"II",2.5]
[{"$nulls":4},"III",2]
[{"$nulls":4},"IV",2]

{"sheet":"Worksheet 4","index":13,"n_rows":45,"n_cols":31,"rows_kept":45,"merged":[[0,0,0,9],[0,11,0,12],[1,0,1,9],[2,0,2,9],[4,0,4,9],[6,0,6,5],[17,13,17,14],[19,13,19,14],[21,12,21,14],[22,15,26,18],[27,6,28,6],[27,7,28,7],[27,15,27,21],[29,15,32,15],[29,16,32,16],[29,17,32,17],[29,18,29,21],[30,18,30,21],[31,18,31,19],[32,11,32,13],[34,13,34,14],[36,13,36,14],[38,13,38,14],[39,13,39,14],[41,13,41,14]]}
[{"$nulls":11},"Comments"]
["ISO 12216:2020 - Small craft - Windows, portlights, hatches, deadlights and doors",{"$nulls":11},"Derived values"]
["WORKSHEET No. 1 data entry",{"$nulls":11},"Input values"]
[]
[{"$f":"CONCATENATE(coverSheet!B5,\"   \",coverSheet!B12,\"    \",Summary!B12)","v":"       "}]
[]
["Parameter",{"$nulls":5},"Symbol","Unit","Value","Ref.",{"$nulls":5},"Material Properties see table F.1 and Tab. 5",{"$nulls":11},"List"]
["Form of plate (Rectangular / Circle)",{"$nulls":5},"R / C",null,{"$f":"Summary!C12","v":0},"Annex C",{"$nulls":5},"Table F.1 mechanical properties [MPa]",null,null,"Tab. 5",{"$nulls":8},"Lists"]
["Long side",{"$nulls":5},"a","mm",{"$f":"Summary!D12","v":0},"7.3, Annex C",{"$nulls":5},"Material","strength","elasticity","safety",{"$nulls":7},"rectangular","R","I","A",{"$f":"IF(I8=\"rectangular\",\"R\",IF(I8=\"circle\",\"C\",\"\"))","v":""}]
["Unsupported short side",{"$nulls":5},"b","mm",{"$f":"Summary!E12","v":0},"7.3, Annex C",{"$nulls":5},"PMMA",110,3000,3.5,{"$nulls":7},"circle","C","IIa","B"]
["Diameter",{"$nulls":5},"d","mm",{"$f":"Summary!F12","v":0},"7.3, Annex C",{"$nulls":5},"PC",90,2400,3.5,{"$nulls":9},"IIb","C"]
["Curve height",{"$nulls":5},"c","mm",{"$f":"Summary!G12","v":0},"7.6",{"$nulls":5},"TG",200,72600,4,{"$nulls":9},"III","D"]
["Support SemiFixed / Simply Supported",{"$nulls":5},"SF / SS",null,{"$f":"Summary!H12","v":0},"3.18",{"$nulls":5},"CG",300,72600,4,{"$nulls":7},"semi-fixed","SF","IV",null,{"$f":"IF(I13=\"semi-fixed\",\"SF\",IF(I13=\"\",\"\",\"SS\"))","v":"SS"}]
["Location type",{"$nulls":5},"I/IIA/IIB/III/IV",null,{"$f":"Summary!I12","v":0},"3.17; Annex A",{"$nulls":5},"AG",40,72600,4,{"$nulls":7},"simply supported","SS"]
["Location area (only loc. III)",{"$nulls":5},"F / S / Any",null,{"$f":"Summary!J12","v":0},"3.17.4",{"$nulls":5},"AMPW",50,7000,2]
["Design Category",{"$nulls":5},"A / B / C / D",null,{"$f":"Summary!K12","v":0},"3.12",{"$nulls":5},"GRP M30",140,7500,2,{"$nulls":6},"any","front","F","Any","yes",{"$f":"IF(I15=\"front\",\"F\",IF(I15=\"side\",\"S\",IF(I15=\"any\",\"A\",\"\")))","v":""}]
["Craft Type Any/Motor/Sail",{"$nulls":5},"Any / M / S",null,{"$f":"Summary!L12","v":0},{"$nulls":6},"GRP M35",175,10000,2,{"$nulls":6},"motor","side","S","M","no"]
["Length of hull as in ISO 8666",{"$nulls":5},"LH","m",{"$f":"Summary!N12","v":{"v":0,"d":"0.00"}},"3.16",{"$nulls":5},"AL 5038",280,70000,2,{"$nulls":6},"sail","any","Any","S",null,{"$f":"IF(I17=\"any\",\"Any\",IF(I17=\"motor\",\"M\",IF(I17=\"sail\",\"S\",\"\")))","v":""}]
["Material data",{"$nulls":7},{"$f":"Summary!O12","v":0},"Table F.1 & 5",{"$nulls":5},"MS",400,200000,2]
[null,"  Ultimate flexural strength",{"$nulls":4},"σU","MPa",{"$f":"'main Side windows 4'!D18","v":{"$error":"#N/A"}},"Table F.1 & 5",{"$nulls":5},"AISI 316 L",510,200000,2]
[null,"  Modulus of elasticity",{"$nulls":4},"E","MPa",{"$f":"'main Side windows 4'!D19","v":{"$error":"#N/A"}},"Table F.1 & 5"]
[null,"  Safety factor",{"$nulls":4},"gamma",". / .",{"$f":"'main Side windows 4'!D20","v":{"$error":"#N/A"}},"Table F.1 & 5",{"$nulls":15},"yes"]
["Is actual plate a sandwich?",{"$nulls":5},"yes / no",null,{"$f":"Summary!Q12","v":0},"7.9",{"$nulls":5},{"$f":"IF(I23=\"YES\",\"The difference in thickness between any two glass plies must be less than or equal to 2 mm and the thickness of the plastic interlayer must be less than, or equal to 0,76 mm for these conditions !\",\"\")","v":""},{"$nulls":9},"no"]
[null,"If yes, enter number of layers",{"$nulls":5},". / .",{"$f":"Summary!R12","v":0},"7.9"]
["Actual plate thickness (in case of sandwich the sum of all layers)",{"$nulls":6},"mm",{"$f":"Summary!U12","v":{"v":0,"d":"0.00"}}]
[]
["Results for non-stiffened plates"]
["Press reduction factor",{"$nulls":5},"Ψ",". / .",{"$f":"'main Side windows 4'!D23","v":false},"7.5"]
["              within limits 0,33 and 1,0",{"$nulls":7},{"$f":"'main Side windows 4'!D24","v":1},"7.5",{"$nulls":5},"Table 5 — Safety factor and minimum thickness of monolithic plates"]
["Basic design press",{"$nulls":5},"p","kPa",{"$f":"'main Side windows 4'!D25","v":1},"7.4",{"$nulls":5},"Material","Acronym","Safety factor\n γ ","Minimum thickness of monolithic plates, tm"]
["Allowable flexural stress",{"$nulls":5},"σa","MPa",{"$f":"'main Side windows 4'!D26","v":{"$error":"#N/A"}},"7.8",{"$nulls":8},"Design categories "]
["Curvature coefficient",{"$nulls":5},"kC",". / .",{"$f":"'main Side windows 4'!D27","v":{"$error":"#DIV/0!"}},"7.6",{"$nulls":8},"Any",null,"A & B","C & D"]
["Ratio a/b (valid ≤ 5)",{"$nulls":6},". / .",{"$f":"'main Side windows 4'!D28","v":{"$error":"#DIV/0!"}},"7.3, Annex G.2",{"$nulls":8},"Area Ia","Area II","Area III & IV","Area III & IV"]
["Ratio a/b corrected",{"$nulls":6},". / .",{"$f":"'main Side windows 4'!D29","v":{"$error":"#DIV/0!"}},"7.3, Annex G.2",{"$nulls":5},"Poly(methyl)methacrylate","PMMA",3.5,"6+0,1(LH-4)",6,5,4]
["Plate aspect ratio coeff stress",{"$nulls":5},"kr",". / .",{"$f":"'main Side windows 4'!D30","v":"FALSCH"},"7.3, Annex G.2",{"$nulls":5},"Polycarbonate","PC",3.5,"6+0,1(LH-4)",6,5,4]
["Pate aspect ratio coeff deflection",{"$nulls":5},"kf",". / .",{"$f":"'main Side windows 4'!D31","v":false},"7.3, Annex G.2",{"$nulls":5},"Monolithic tempered glass ","TG",4,"5+0,1(LH-4)b",4,4,3]
[{"$nulls":15},"Laminated glass ","LG",4,"5+0,1(LH-4)b",4,4,3]
["Thickness (Stress)",{"$nulls":5},"tr","mm",{"$f":"'main Side windows 4'!D33","v":{"$error":"#DIV/0!"}},"7.1.1",{"$nulls":5},"All mahogany plywood ","AMPW",2,"8+0,1(LH-4)",6,5,4]
["Thickness (Deflection)",{"$nulls":5},"tf","mm",{"$f":"'main Side windows 4'!D34","v":{"$error":"#DIV/0!"}},"7.1.2",{"$nulls":5},"GRP mat 30 % glass ","GRP M30",2,"4+0,1(LH-4)",3,3,2]
["Thickness",{"$nulls":6},"mm",{"$f":"'main Side windows 4'!D35","v":{"$error":"#DIV/0!"}},{"$nulls":6},"GRP mat/roving 35 % glass ","GRP M35",2,"4+0,1(LH-4)",3,3,2]
["Thickness minimu, techn. ",{"$nulls":5},"tm","mm",{"$f":"'main Side windows 4'!D36","v":{"$error":"#DIV/0!"}},"7.8",{"$nulls":5},"Aluminium alloy 5083-H111 ","AL 5038",2,"3+0,05 (LH-4)",3,3,2]
["Thickness minimum, Tab 5",{"$nulls":6},"mm",{"$f":"'main Side windows 4'!D37","v":{"v":0,"d":"0.0"}},"Table 5",{"$nulls":5},"Mild steel ","MS",2,"2,5+0,025 (LH-4)",2.5,2.5,2]
[]
["Required plate thickness",{"$nulls":6},"mm",{"$f":"'main Side windows 4'!I31","v":{"$error":"#DIV/0!"}}]
["Requirements fullfilled?",{"$nulls":7},{"$f":"IF(L13=\"short side in area I max 300mm\",\"FAIL\",IF(I25>=I44,\"PASS\",\"FAIL\"))","v":{"$error":"#DIV/0!"}}]

{"sheet":"main Side windows 4","index":14,"n_rows":43,"n_cols":24,"rows_kept":43,"hidden":true,"merged":[[0,0,0,5],[1,0,1,5],[25,11,28,18],[26,6,26,7]]}
[{"$nulls":6},"manufacturer"]
[{"$nulls":6},"model name"]
["Eingabe","Version 1.2.2 / 15-03-2006 rev 060512/070507/dew 090918",{"$nulls":4},"ISO/FDIS 12216:2002(E)"]
["Parameter Input","SSign","Item/Unit",{"$nulls":18},"Lists"]
["form of plate Rectangular/Circle",null,"R/C",{"$f":"'Worksheet 4'!AE9","v":""},{"$f":"IF(D5=\"\",\"Input R oder C\",\"\")","v":"Input R oder C"},null,"Material Properties see table F.1 and Tab. 5",{"$nulls":14},"R","I","A"]
["long side","a","mm",{"$f":"'Worksheet 4'!I9","v":0},{"$f":"IF(AND(D5=\"R\",D6=\"\"),\"Input a requested\",IF(AND(D5=\"C\",D6=\"\"),\"Input d requested\",\"\"))","v":""},null,"Table F.1 mechanical properties [Mpa]",null,null,"Tab. 5",{"$nulls":11},"C","IIa","B"]
["unsupported short side","b","mm",{"$f":"'Worksheet 4'!I10","v":0},{"$f":"IF(AND(D5=\"R\",D7=\"\"),\"Input b requested\",IF(AND(D5=\"C\",D7=\"\"),\"Input d requested\",\"\"))","v":""},null,"Material","strength","elasticity","safety",{"$nulls":12},"IIb","C"]
["diameter","d","mm",{"$f":"'Worksheet 4'!I11","v":0},{"$f":"IF(AND(D5=\"C\",D8=\"\"),\"Input d requested\",\"\")","v":""},null,"PMMA",110,3000,3.5,{"$nulls":3},"AG",40,72600,4,{"$nulls":5},"III","D"]
["curve height","c","mm",{"$f":"'Worksheet 4'!I12","v":0},"optional",null,"PC",90,2400,3.5,{"$nulls":3},"AISI 316 L",510,200000,2,{"$nulls":4},"SF","IV"]
["support SemiFixed/Simple Supp.",null,"SF/SS",{"$f":"'Worksheet 4'!AE13","v":"SS"},{"$f":"IF(D10=\"\",\"Input SF or SS\",\"\")","v":""},null,"TG",200,72600,4,null,null,"6.1","AL 5038",280,70000,2,{"$nulls":4},"SS"]
["Location type",null,"I/IIA/IIB/III/IV",{"$f":"'Worksheet 4'!I14","v":{"v":0,"d":"0.00"}},{"$f":"IF(D11=\"\",\"Input I / IIa,b / III / IV\",\"\")","v":""},null,"CG",300,72600,4,null,null,"3.17.1-4","AMPW",50,7000,2]
["Location area (only loc. III)",null,"F/S/A",{"$f":"'Worksheet 4'!AE16","v":""},{"$f":"IF(D12=\"F\",\"\",IF(D12=\"S\",\"\",IF(D12=\"A\",\"\",IF(D11=\"III\",\"Input F / S / A\",\"\"))))","v":""},null,"AG",40,72600,4,{"$nulls":3},"CG",300,72600,4,{"$nulls":4},"F","Any","yes"]
["Design Category",null,"A/B/C/D",{"$f":"IF('Worksheet 4'!I16=\"\",\"\",'Worksheet 4'!I16)","v":{"v":0,"d":"0.00"}},{"$f":"IF(D13=\"\",\"Input A / B / C / D\",\"\")","v":""},null,"AMPW",50,7000,2,{"$nulls":3},"GRP M30",140,7500,2,{"$nulls":4},"S","M","no"]
["Craft Type Any/Motor/Sail",null,"Any/M/S",{"$f":"'Worksheet 4'!AE18","v":""},{"$f":"IF(D14=\"\",\"Input Any / M / S\",\"\")","v":"Input Any / M / S"},null,"GRP M30",140,7500,2,{"$nulls":3},"GRP M35",175,10000,2,{"$nulls":4},"A","S"]
["optional: craft length of hull",null,"m",{"$f":"'Worksheet 4'!I18","v":{"v":0,"d":"0.00"}},"default, change if smaller",null,"GRP M35",175,10000,2,{"$nulls":3},"MS",400,200000,2]
[{"$nulls":6},"AL 5038",280,70000,2,{"$nulls":3},"PC",90,2400,3.5]
["Material",null,"see Tab. F.1",{"$f":"'Worksheet 4'!I19","v":{"v":0,"d":"0.00"}},{"$f":"IF(D17=\"\",\"manual input requ\",\"\")","v":""},null,"MS",400,200000,2,{"$nulls":3},"PMMA",110,3000,3.5]
["  ultimate flexural strength","Sigma u",null,{"$f":"LOOKUP(D17,N8:N18,O8:O18)","v":{"$error":"#N/A"}},"falls nicht in F.1 ",null,"AISI 316 L",510,200000,2,{"$nulls":3},"TG",200,72600,4]
["  modulus of elasticity","E",null,{"$f":"LOOKUP(D17,N8:N18,P8:P18)","v":{"$error":"#N/A"}},"Werte manuell"]
["  safety factor","gamma",null,{"$f":"LOOKUP(D17,N8:N18,Q8:Q18)","v":{"$error":"#N/A"}},"eintragen"]
[]
["Results for non-stiffened plates"]
["press reduction factor",null,null,{"$f":"IF(D5=\"R\",1.102-0.0004*D7,IF(D5=\"C\",1.102-0.0004*D8))","v":false},"(7.5)"]
["              within limits 0,33 and 1,0","psi",null,{"$f":"IF(D23<0.33,0.33,IF(D23>1,1,D23))","v":{"v":1,"d":"1.000"}},"(7.5)"]
["basic design press","p","KPa",{"$f":"'basic design pressure 4'!G43","v":{"v":1,"d":"1.00"}},"(7.4)",null,"see work sheet \"basic design press\""]
["allowable flexural stress","Sigma a","MPa",{"$f":"D18/D20","v":{"$error":"#N/A"}},"(7.8)",null,"is actual plate a sandwich?",null,{"$f":"'Worksheet 4'!I23","v":0},null,null,{"$f":"IF(I26=\"YES\",\"the difference in thickness between any two glass plies must be less than or equal to 2 mm and the thickness of the plastic interlayer must be less than, or equal to 0,76 mm for these conditions !\",\"\")","v":""}]
["curvature coefficient","kc",null,{"$f":"IF(D5=\"C\",1-(D9/D8),1-(D9/D7))","v":{"$error":"#DIV/0!"}},"(7.6)",null,{"$f":"IF(I26=\"yes\", \"number of layers?\",\"\")","v":""},null,{"$f":"IF('Worksheet 4'!I24=\"\",\"\",'Worksheet 4'!I24)","v":0}]
["              a/b real  (valid ≤ 5)",null,null,{"$f":"IF(D5=\"C\",1,D6/D7)","v":{"$error":"#DIV/0!"}},"(7.3) Annex G.2"]
["              a/b corrected",null,null,{"$f":"IF(D28>5,5,D28)","v":{"$error":"#DIV/0!"}},"(7.3) Annex G.2"]
["plate aspect ratio coeff stress","kr",null,{"$f":"IF(D5=\"R\",IF(D10=\"SF\",(0.62165*D29^2-0.6473*D29+0.26481)/(D29^2-1.173*D29+0.97671),IF(D10=\"SS\",(0.69952*D29^2+0.02662*D29-0.0735)/(D29^2-0.7185*D29+1.98925),\"Fehler\")),IF(D5=\"C\",IF(D10=\"SF\",0.248,0.309),\"FALSCH\"))","v":"FALSCH"},"(7.3) Annex G.2",null,"actual plate Thickness",null,{"$f":"'Worksheet 4'!I25","v":0},"mm",null,{"$f":"IF(I26=\"yes\", \"=sum of all plies\",\"\")","v":""}]
["pate aspect ratio coeff deflection","kf",null,{"$f":"IF(D5=\"R\",IF(D10=\"SF\",(0.08052*D29^2-0.0272*D29-0.0019)/(D29^2-0.9275*D29+1.70018),IF(D10=\"SS\",(0.12915*D29^2+0.00868*D29-0.0293)/(D29^2-0.887*D29+2.3372),\"Fehler\")),IF(D5=\"C\",IF(D10=\"SF\",0.027,0.043)))","v":false},"(7.3) Annex G.2",null,"required plate thickness",null,{"$f":"IF(AND(I26=\"Yes\",I27=\"\"),\"please enter number of layers\",IF(AND(I26=\"Yes\",I27>2),1.5*MAX(D35:D37),IF(AND(I26=\"Yes\",I27=2),1.2*MAX(D35:D37),IF(I36=\"Yes\",MAX(D36:D37),MAX(D35:D37)))))","v":{"$error":"#DIV/0!"}}]
[{"$nulls":6},"requirements fulfilled?",null,{"$f":"IF(I30=\"\",\"\",IF(I30>=I31,\"PASS\",\"FAIL\"))","v":{"$error":"#DIV/0!"}}]
["Thickness (Stress)","tr","mm",{"$f":"IF(D5=\"C\",D8*D27*SQRT(D30*D24*D25/D26/1000),D7*D27*SQRT(D30*D24*D25/D26/1000))","v":{"$error":"#DIV/0!"}},"(7.1.1)"]
["Thickness (Deflection)","tf","mm",{"$f":"0.45*(D33+D7*D27*POWER((D31*D24*D25/0.02/D19/1000),0.33333))","v":{"$error":"#DIV/0!"}},"(7.1.2)"]
["Thickness",null,null,{"$f":"ROUND(MAX(D33:D34),2)","v":{"$error":"#DIV/0!"}},"(7.1.7)",{"$nulls":3},"Minimum tech used???"]
["Thickness minimu, techn. ",null,"mm",{"$f":"D35-0.5","v":{"$error":"#DIV/0!"}},null,null," = Minimum, absolute",null,{"$f":"Summary!P12","v":0}]
["Thickness minimum, Tab 5","tm","mm",{"$f":"'basic design pressure 4'!J48","v":{"v":0,"d":"0.0"}},"(Tab. 5)",null,"(only PMMA, PC, TG, LG)"]
[]
["Escape Hatch possible ?"]
["Required ISO 9094-1, 2"]
["Circular: inner Diam > 450 mm",null,null,{"$f":"IF(D5=\"C\",IF(D8>450,\"pass\",\"fail\"),\"n.a.\")","v":"n.a."}]
["Rectang: inner Diam > 380 mm",null,null,{"$f":"IF(D5=\"R\",IF(MAX(D6:D7)>380,\"pass\",\"fail\"),\"n.a.\")","v":"n.a."}]
["              Area > 180000 mm²",null,null,{"$f":"IF(D5=\"R\",IF(D6*D7>180000,\"pass\",\"fail\"),\"n.a.\")","v":"n.a."}]

{"sheet":"basic design pressure 4","index":15,"n_rows":193,"n_cols":10,"rows_kept":193,"hidden":true}
["Basic design pressure",null,null,"(7.4 Table 4)"]
[]
["location",null,{"$f":"'main Side windows 4'!D11","v":0}]
["particular",null,{"$f":"IF(AND(C5=\"C\",C6=\"M\",C3=\"III\"),\"A\",'main Side windows 4'!D12)","v":""},null,"Remark: f=front, s=side"]
["design cat",null,{"$f":"'main Side windows 4'!D13","v":0}]
["craft type",null,{"$f":"'main Side windows 4'!D14","v":""},{"$f":"IF(C6=\"Any\",\"S\",C6)","v":""},"Remark: if craft type = Any, set craft type = S"]
[]
[]
["Tabelle 4",null,"location","craft type","design cat","particular","pressure"]
[null,null,"I","Any","Any","Any",70]
[null,null,"IIB","Any","A","Any",70]
[null,null,"IIB","Any","B","Any",50]
[null,null,"IIB","Any","C","Any",28]
[null,null,"IIB","Any","D","Any",28]
[null,null,"IIA","Any","Any","Any",28]
[null,null,"III","S","A","Any",18]
[null,null,"III","S","B","Any",18]
[null,null,"III","S","C","Any",12]
[null,null,"III","S","D","Any",12]
[null,null,"III","M","A","Front",12]
[null,null,"III","M","A","Any",12]
[null,null,"III","M","B","Front",9]
[null,null,"III","M","B","Any",9]
[null,null,"III","M","D","Front",6,null,null,"Korrektur, Zeile eingefügt um Fehler bei eingabe III, M, Front, D zu beheben"]
[null,null,"III","M","A","Side",9]
[null,null,"III","M","B","Side",6]
[null,null,"III","M","C","Any",6]
[null,null,"III","M","D","Any",6]
[null,null,"IV","S","Any","Any",12]
[null,null,"IV","M","Any","Any",6]
[]
["Ergebnis"]
[null,"location = I",{"$nulls":4},{"$f":"IF(C3=\"I\",G10,0)","v":0}]
[null,"location = IIB",{"$nulls":4},{"$f":"IF(C3=\"IIB\",VLOOKUP(C5,E11:G15,3),0)","v":0}]
[null,"location = IIA",{"$nulls":4},{"$f":"IF(C3=\"IIA\",VLOOKUP(C3,E11:G15,3),0)","v":0}]
[null,"location = III","craft = S",{"$nulls":3},{"$f":"IF(AND(C3=\"III\",D6=\"S\"),VLOOKUP(C5,E16:G19,3),0)","v":0}]
[null,"location = III","craft = M","particular = front",null,null,{"$f":"IF(AND(C3=\"III\",D6=\"M\",C4=\"F\"),VLOOKUP(C5,E20:G24,3),0)","v":0}]
[null,"location = III","craft = M","particular = any",null,null,{"$f":"IF(AND(OR(C5=\"A\",C5=\"B\"),C3=\"III\",D6=\"M\",C4=\"A\"),VLOOKUP(C5,E20:G24,3),0)","v":0}]
[null,"location = III","craft = M","particular = side",null,null,{"$f":"IF(AND(C3=\"III\",C6=\"M\",C4=\"S\"),IF(C5=\"A\",9,IF(C5=\"B\",6,0)))","v":false}]
[null,"location = III","craft = M",{"$nulls":3},{"$f":"IF(C5=\"A\",0,IF(C5=\"B\",0,IF(AND(C3=\"III\",C6=\"M\"),VLOOKUP(C5,E27:G28,3))))","v":false}]
[null,"location = IV",{"$nulls":4},{"$f":"IF(C3=\"IV\",VLOOKUP(D6,D29:G30,4,0),1)","v":1}]
[]
["pressure",{"$nulls":5},{"$f":"MAX(G33:G41)","v":1}]
[]
[]
["minimum thickness"]
[]
[null,"Area",{"$f":"IF(OR('main Side windows 4'!D11=\"IIA\",'main Side windows 4'!D11=\"IIB\"),\"II\",'main Side windows 4'!D11)","v":0},{"$nulls":4},"minimum thickness",null,{"$f":"MAX(J50:J190)","v":0}]
[]
[null,null,"PMMA","A","I",{"$f":" IF('main Side windows 4'!$D$15>0,6 + 0.1*('main Side windows 4'!$D$15-4),\"\")","v":""},{"$nulls":3},{"$f":"IF('main Side windows 4'!$D$17=\"PMMA\",(IF('main Side windows 4'!$D$13=\"A\",VLOOKUP($C$48,$E$50:$F$53,2,-1),0)),0)","v":0}]
["Table 5",{"$nulls":3},"II",6]
[{"$nulls":4},"III",5]
[{"$nulls":4},"IV",5]
[null,null,"PMMA","B","I",{"$f":" IF('main Side windows 4'!$D$15>0,6 + 0.1*('main Side windows 4'!$D$15-4),\"\")","v":""},{"$nulls":3},{"$f":"IF('main Side windows 4'!$D$17=\"PMMA\",(IF('main Side windows 4'!$D$13=\"B\",VLOOKUP($C$48,$E$54:$F$57,2,-1),0)),0)","v":0}]
[{"$nulls":4},"II",6]
[{"$nulls":4},"III",5]
[{"$nulls":4},"IV",5]
[null,null,"PMMA","C","I",{"$f":" IF('main Side windows 4'!$D$15>0,6 + 0.1*('main Side windows 4'!$D$15-4),\"\")","v":""},{"$nulls":3},{"$f":"IF('main Side windows 4'!$D$17=\"PMMA\",(IF('main Side windows 4'!$D$13=\"C\",VLOOKUP($C$48,$E$58:$F$61,2,-1),0)),0)","v":0}]
[{"$nulls":4},"II",6]
[{"$nulls":4},"III",4]
[{"$nulls":4},"IV",4]
[null,null,"PMMA","D","I",{"$f":" IF('main Side windows 4'!$D$15>0,6 + 0.1*('main Side windows 4'!$D$15-4),\"\")","v":""},{"$nulls":3},{"$f":"IF('main Side windows 4'!$D$17=\"PMMA\",(IF('main Side windows 4'!$D$13=\"D\",VLOOKUP($C$48,E62:F65,2,-1),0)),0)","v":0}]
[{"$nulls":4},"II",6]
[{"$nulls":4},"III",4]
[{"$nulls":4},"IV",4]
[null,null,"PC","A","I",{"$f":" IF('main Side windows 4'!$D$15>0,6 + 0.1*('main Side windows 4'!$D$15-4),\"\")","v":""},{"$nulls":3},{"$f":"IF('main Side windows 4'!$D$17=\"PC\",(IF('main Side windows 4'!$D$13=\"A\",VLOOKUP($C$48,E66:F69,2,-1),0)),0)","v":0}]
[{"$nulls":4},"II",6]
[{"$nulls":4},"III",5]
[{"$nulls":4},"IV",5]
[null,null,"PC","B","I",{"$f":" IF('main Side windows 4'!$D$15>0,6 + 0.1*('main Side windows 4'!$D$15-4),\"\")","v":""},{"$nulls":3},{"$f":"IF('main Side windows 4'!$D$17=\"PC\",(IF('main Side windows 4'!$D$13=\"B\",VLOOKUP($C$48,E70:F73,2,-1),0)),0)","v":0}]
[{"$nulls":4},"II",6]
[{"$nulls":4},"III",5]
[{"$nulls":4},"IV",5]
[null,null,"PC","C","I",{"$f":" IF('main Side windows 4'!$D$15>0,6 + 0.1*('main Side windows 4'!$D$15-4),\"\")","v":""},{"$nulls":3},{"$f":"IF('main Side windows 4'!$D$17=\"PC\",(IF('main Side windows 4'!$D$13=\"C\",VLOOKUP($C$48,E74:F77,2,-1),0)),0)","v":0}]
[{"$nulls":4},"II",6]
[{"$nulls":4},"III",4]
[{"$nulls":4},"IV",4]
[null,null,"PC","D","I",{"$f":" IF('main Side windows 4'!$D$15>0,6 + 0.1*('main Side windows 4'!$D$15-4),\"\")","v":""},{"$nulls":3},{"$f":"IF('main Side windows 4'!$D$17=\"PC\",(IF('main Side windows 4'!$D$13=\"D\",VLOOKUP($C$48,E78:F81,2,-1),0)),0)","v":0}]
[{"$nulls":4},"II",6]
[{"$nulls":4},"III",4]
[{"$nulls":4},"IV",4]
[null,null,"TG","A","I",{"$f":" IF('main Side windows 4'!$D$15>0,5+ 0.1*('main Side windows 4'!$D$15-4),\"\")","v":""},{"$nulls":3},{"$f":"IF('main Side windows 4'!$D$17=\"TG\",(IF('main Side windows 4'!$D$13=\"A\",VLOOKUP($C$48,E82:F85,2,-1),0)),0)","v":0}]
[{"$nulls":4},"II",4]
[{"$nulls":4},"III",4]
[{"$nulls":4},"IV",4]
[null,null,"TG","B","I",{"$f":" IF('main Side windows 4'!$D$15>0,5+ 0.1*('main Side windows 4'!$D$15-4),\"\")","v":""},{"$nulls":3},{"$f":"IF('main Side windows 4'!$D$17=\"TG\",(IF('main Side windows 4'!$D$13=\"B\",VLOOKUP($C$48,E86:F89,2,-1),0)),0)","v":0}]
[{"$nulls":4},"II",4]
[{"$nulls":4},"III",4]
[{"$nulls":4},"IV",4]
[null,null,"TG","C","I",{"$f":" IF('main Side windows 4'!$D$15>0,5+ 0.1*('main Side windows 4'!$D$15-4),\"\")","v":""},{"$nulls":3},{"$f":"IF('main Side windows 4'!$D$17=\"TG\",(IF('main Side windows 4'!$D$13=\"C\",VLOOKUP($C$48,E90:F93,2,-1),0)),0)","v":0}]
[{"$nulls":4},"II",4]
[{"$nulls":4},"III",3]
[{"$nulls":4},"IV",3]
[null,null,"TG","D","I",{"$f":" IF('main Side windows 4'!$D$15>0,5+ 0.1*('main Side windows 4'!$D$15-4),\"\")","v":""},{"$nulls":3},{"$f":"IF('main Side windows 4'!$D$17=\"TG\",(IF('main Side windows 4'!$D$13=\"D\",VLOOKUP($C$48,E94:F97,2,-1),0)),0)","v":0}]
[{"$nulls":4},"II",4]
[{"$nulls":4},"III",3]
[{"$nulls":4},"IV",3]
[null,null,"LG","A","I",{"$f":" IF('main Side windows 4'!$D$15>0,5+ 0.1*('main Side windows 4'!$D$15-4),\"\")","v":""},{"$nulls":3},{"$f":"IF('main Side windows 4'!$D$17=\"LG\",(IF('main Side windows 4'!$D$13=\"A\",VLOOKUP($C$48,E98:F101,2,-1),0)),0)","v":0}]
[{"$nulls":4},"II",4]
[{"$nulls":4},"III",4]
[{"$nulls":4},"IV",4]
[null,null,"LG","B","I",{"$f":" IF('main Side windows 4'!$D$15>0,5+ 0.1*('main Side windows 4'!$D$15-4),\"\")","v":""},{"$nulls":3},{"$f":"IF('main Side windows 4'!$D$17=\"LG\",(IF('main Side windows 4'!$D$13=\"B\",VLOOKUP($C$48,E102:F105,2,-1),0)),0)","v":0}]
[{"$nulls":4},"II",4]
[{"$nulls":4},"III",4]
[{"$nulls":4},"IV",4]
[null,null,"LG","C","I",{"$f":" IF('main Side windows 4'!$D$15>0,5+ 0.1*('main Side windows 4'!$D$15-4),\"\")","v":""},{"$nulls":3},{"$f":"IF('main Side windows 4'!$D$17=\"LG\",(IF('main Side windows 4'!$D$13=\"C\",VLOOKUP($C$48,E106:F109,2,-1),0)),0)","v":0}]
[{"$nulls":4},"II",4]
[{"$nulls":4},"III",3]
[{"$nulls":4},"IV",3]
[null,null,"LG","D","I",{"$f":" IF('main Side windows 4'!$D$15>0,5+ 0.1*('main Side windows 4'!$D$15-4),\"\")","v":""},{"$nulls":3},{"$f":"IF('main Side windows 4'!$D$17=\"LG\",(IF('main Side windows 4'!$D$13=\"D\",VLOOKUP($C$48,E110:F113,2,-1),0)),0)","v":0}]
[{"$nulls":4},"II",4]
[{"$nulls":4},"III",3]
[{"$nulls":4},"IV",3]
[null,null,"AMPW","A","I",{"$f":" IF('main Side windows 4'!$D$15>0,8+ 0.1*('main Side windows 4'!$D$15-4),\"\")","v":""},{"$nulls":3},{"$f":"IF('main Side windows 4'!$D$17=\"AMPW\",(IF('main Side windows 4'!$D$13=\"A\",VLOOKUP($C$48,E114:F117,2,-1),0)),0)","v":0}]
[{"$nulls":4},"II",6]
[{"$nulls":4},"III",5]
[{"$nulls":4},"IV",5]
[null,null,"AMPW","B","I",{"$f":" IF('main Side windows 4'!$D$15>0,8+ 0.1*('main Side windows 4'!$D$15-4),\"\")","v":""},{"$nulls":3},{"$f":"IF('main Side windows 4'!$D$17=\"AMPW\",(IF('main Side windows 4'!$D$13=\"B\",VLOOKUP($C$48,E118:F121,2,-1),0)),0)","v":0}]
[{"$nulls":4},"II",6]
[{"$nulls":4},"III",5]
[{"$nulls":4},"IV",5]
[null,null,"AMPW","C","I",{"$f":" IF('main Side windows 4'!$D$15>0,8+ 0.1*('main Side windows 4'!$D$15-4),\"\")","v":""},{"$nulls":3},{"$f":"IF('main Side windows 4'!$D$17=\"AMPW\",(IF('main Side windows 4'!$D$13=\"C\",VLOOKUP($C$48,E122:F125,2,-1),0)),0)","v":0}]
[{"$nulls":4},"II",6]
[{"$nulls":4},"III",4]
[{"$nulls":4},"IV",4]
[null,null,"AMPW","D","I",{"$f":" IF('main Side windows 4'!$D$15>0,8+ 0.1*('main Side windows 4'!$D$15-4),\"\")","v":""},{"$nulls":3},{"$f":"IF('main Side windows 4'!$D$17=\"AMPW\",(IF('main Side windows 4'!$D$13=\"D\",VLOOKUP($C$48,E126:F129,2,-1),0)),0)","v":0}]
[{"$nulls":4},"II",6]
[{"$nulls":4},"III",4]
[{"$nulls":4},"IV",4]
[null,null,"GRP m30","A","I",{"$f":" IF('main Side windows 4'!$D$15>0,4 + 0.1*('main Side windows 4'!$D$15-4),\"\")","v":""},{"$nulls":3},{"$f":"IF('main Side windows 4'!$D$17=\"GRP M30\",(IF('main Side windows 4'!$D$13=\"A\",VLOOKUP($C$48,E130:F133,2,-1),0)),0)","v":0}]
[{"$nulls":4},"II",3]
[{"$nulls":4},"III",3]
[{"$nulls":4},"IV",3]
[null,null,"GRP m30","B","I",{"$f":" IF('main Side windows 4'!$D$15>0,4 + 0.1*('main Side windows 4'!$D$15-4),\"\")","v":""},{"$nulls":3},{"$f":"IF('main Side windows 4'!$D$17=\"GRP M30\",(IF('main Side windows 4'!$D$13=\"B\",VLOOKUP($C$48,E134:F137,2,-1),0)),0)","v":0}]
[{"$nulls":4},"II",3]
[{"$nulls":4},"III",3]
[{"$nulls":4},"IV",3]
[null,null,"GRP m30","C","I",{"$f":" IF('main Side windows 4'!$D$15>0,4 + 0.1*('main Side windows 4'!$D$15-4),\"\")","v":""},{"$nulls":3},{"$f":"IF('main Side windows 4'!$D$17=\"GRP M30\",(IF('main Side windows 4'!$D$13=\"C\",VLOOKUP($C$48,E138:F141,2,-1),0)),0)","v":0}]
[{"$nulls":4},"II",3]
[{"$nulls":4},"III",2]
[{"$nulls":4},"IV",2]
[null,null,"GRP m30","D","I",{"$f":" IF('main Side windows 4'!$D$15>0,4 + 0.1*('main Side windows 4'!$D$15-4),\"\")","v":""},{"$nulls":3},{"$f":"IF('main Side windows 4'!$D$17=\"GRP M30\",(IF('main Side windows 4'!$D$13=\"D\",VLOOKUP($C$48,E142:F145,2,-1),0)),0)","v":0}]
[{"$nulls":4},"II",3]
[{"$nulls":4},"III",2]
[{"$nulls":4},"IV",2]
[null,null,"GRP m35","A","I",{"$f":" IF('main Side windows 4'!$D$15>0,4 + 0.1*('main Side windows 4'!$D$15-4),\"\")","v":""},{"$nulls":3},{"$f":"IF('main Side windows 4'!$D$17=\"GRP M35\",(IF('main Side windows 4'!$D$13=\"A\",VLOOKUP($C$48,E146:F149,2,-1),0)),0)","v":0}]
[{"$nulls":4},"II",3]
[{"$nulls":4},"III",3]
[{"$nulls":4},"IV",3]
[null,null,"GRP m35","B","I",{"$f":" IF('main Side windows 4'!$D$15>0,4 + 0.1*('main Side windows 4'!$D$15-4),\"\")","v":""},{"$nulls":3},{"$f":"IF('main Side windows 4'!$D$17=\"GRP M35\",(IF('main Side windows 4'!$D$13=\"B\",VLOOKUP($C$48,E150:F153,2,-1),0)),0)","v":0}]
[{"$nulls":4},"II",3]
[{"$nulls":4},"III",3]
[{"$nulls":4},"IV",3]
[null,null,"GRP m35","C","I",{"$f":" IF('main Side windows 4'!$D$15>0,4 + 0.1*('main Side windows 4'!$D$15-4),\"\")","v":""},{"$nulls":3},{"$f":"IF('main Side windows 4'!$D$17=\"GRP M35\",(IF('main Side windows 4'!$D$13=\"C\",VLOOKUP($C$48,E154:F157,2,-1),0)),0)","v":0}]
[{"$nulls":4},"II",3]
[{"$nulls":4},"III",2]
[{"$nulls":4},"IV",2]
[null,null,"GRP m35","D","I",{"$f":" IF('main Side windows 4'!$D$15>0,4 + 0.1*('main Side windows 4'!$D$15-4),\"\")","v":""},{"$nulls":3},{"$f":"IF('main Side windows 4'!$D$17=\"GRP M35\",(IF('main Side windows 4'!$D$13=\"D\",VLOOKUP($C$48,E158:F161,2,-1),0)),0)","v":0}]
[{"$nulls":4},"II",3]
[{"$nulls":4},"III",2]
[{"$nulls":4},"IV",2]
[null,null,"Al 5038","A","I",{"$f":" IF('main Side windows 4'!$D$15>0,3 + 0.05*('main Side windows 4'!$D$15-4),\"\")","v":""},{"$nulls":3},{"$f":"IF('main Side windows 4'!$D$17=\"Al 5038\",(IF('main Side windows 4'!$D$13=\"A\",VLOOKUP($C$48,E162:F165,2,-1),0)),0)","v":0}]
[{"$nulls":4},"II",3]
[{"$nulls":4},"III",3]
[{"$nulls":4},"IV",3]
[null,null,"Al 5038","B","I",{"$f":" IF('main Side windows 4'!$D$15>0,3 + 0.05*('main Side windows 4'!$D$15-4),\"\")","v":""},{"$nulls":3},{"$f":"IF('main Side windows 4'!$D$17=\"AL 5038\",(IF('main Side windows 4'!$D$13=\"B\",VLOOKUP($C$48,E166:F169,2,-1),0)),0)","v":0}]
[{"$nulls":4},"II",3]
[{"$nulls":4},"III",3]
[{"$nulls":4},"IV",3]
[null,null,"Al 5038","C","I",{"$f":" IF('main Side windows 4'!$D$15>0,3 + 0.05*('main Side windows 4'!$D$15-4),\"\")","v":""},{"$nulls":3},{"$f":"IF('main Side windows 4'!$D$17=\"AL 5038\",(IF('main Side windows 4'!$D$13=\"C\",VLOOKUP($C$48,E170:F173,2,-1),0)),0)","v":0}]
[{"$nulls":4},"II",3]
[{"$nulls":4},"III",2]
[{"$nulls":4},"IV",2]
[null,null,"Al 5038","D","I",{"$f":" IF('main Side windows 4'!$D$15>0,3 + 0.05*('main Side windows 4'!$D$15-4),\"\")","v":""},{"$nulls":3},{"$f":"IF('main Side windows 4'!$D$17=\"AL 5038\",(IF('main Side windows 4'!$D$13=\"D\",VLOOKUP($C$48,E174:F177,2,-1),0)),0)","v":0}]
[{"$nulls":4},"II",3]
[{"$nulls":4},"III",2]
[{"$nulls":4},"IV",2]
[null,null,"MS","A","I",{"$f":" IF('main Side windows 4'!$D$15>0,2.5 + 0.025*('main Side windows 4'!$D$15-4),\"\")","v":""},{"$nulls":3},{"$f":"IF('main Side windows 4'!$D$17=\"MS\",(IF('main Side windows 4'!$D$13=\"A\",VLOOKUP($C$48,E178:F181,2,-1),0)),0)","v":0}]
[{"$nulls":4},"II",2.5]
[{"$nulls":4},"III",2.5]
[{"$nulls":4},"IV",2.5]
[null,null,"MS","B","I",{"$f":" IF('main Side windows 4'!$D$15>0,2.5 + 0.025*('main Side windows 4'!$D$15-4),\"\")","v":""},{"$nulls":3},{"$f":"IF('main Side windows 4'!$D$17=\"MS\",(IF('main Side windows 4'!$D$13=\"B\",VLOOKUP($C$48,E182:F185,2,-1),0)),0)","v":0}]
[{"$nulls":4},"II",2.5]
[{"$nulls":4},"III",2.5]
[{"$nulls":4},"IV",2.5]
[null,null,"MS","C","I",{"$f":" IF('main Side windows 4'!$D$15>0,2.5 + 0.025*('main Side windows 4'!$D$15-4),\"\")","v":""},{"$nulls":3},{"$f":"IF('main Side windows 4'!$D$17=\"MS\",(IF('main Side windows 4'!$D$13=\"C\",VLOOKUP($C$48,E186:F189,2,-1),0)),0)","v":0}]
[{"$nulls":4},"II",2.5]
[{"$nulls":4},"III",2]
[{"$nulls":4},"IV",2]
[null,null,"MS","D","I",{"$f":" IF('main Side windows 4'!$D$15>0,2.5 + 0.025*('main Side windows 4'!$D$15-4),\"\")","v":""},{"$nulls":3},{"$f":"IF('main Side windows 4'!$D$17=\"MS\",(IF('main Side windows 4'!$D$13=\"D\",VLOOKUP($C$48,E190:F193,2,-1),0)),0)","v":0}]
[{"$nulls":4},"II",2.5]
[{"$nulls":4},"III",2]
[{"$nulls":4},"IV",2]

{"sheet":"Worksheet 5","index":16,"n_rows":45,"n_cols":31,"rows_kept":45,"merged":[[0,0,0,9],[0,11,0,12],[1,0,1,9],[2,0,2,9],[4,0,4,9],[6,0,6,5],[17,13,17,14],[19,13,19,14],[21,12,21,14],[22,15,26,18],[27,6,28,6],[27,7,28,7],[27,15,27,21],[29,15,32,15],[29,16,32,16],[29,17,32,17],[29,18,29,21],[30,18,30,21],[31,18,31,19],[32,11,32,13],[34,13,34,14],[36,13,36,14],[38,13,38,14],[39,13,39,14],[41,13,41,14]]}
[{"$nulls":11},"Comments"]
["ISO 12216:2020 - Small craft - Windows, portlights, hatches, deadlights and doors",{"$nulls":11},"Derived values"]
["WORKSHEET No. 1 data entry",{"$nulls":11},"Input values"]
[]
[{"$f":"CONCATENATE(coverSheet!B5,\"   \",coverSheet!B12,\"   \",Summary!B13)","v":"      "}]
[]
["Parameter",{"$nulls":5},"Symbol","Unit","Value","Ref.",{"$nulls":5},"Material Properties see table F.1 and Tab. 5",{"$nulls":11},"List"]
["Form of plate (Rectangular / Circle)",{"$nulls":5},"R / C",null,{"$f":"Summary!C13","v":0},"Annex C",{"$nulls":5},"Table F.1 mechanical properties [MPa]",null,null,"Tab. 5",{"$nulls":8},"Lists"]
["Long side",{"$nulls":5},"a","mm",{"$f":"Summary!D13","v":0},"7.3, Annex C",{"$nulls":5},"Material","strength","elasticity","safety",{"$nulls":7},"rectangular","R","I","A",{"$f":"IF(I8=\"rectangular\",\"R\",IF(I8=\"circle\",\"C\",\"\"))","v":""}]
["Unsupported short side",{"$nulls":5},"b","mm",{"$f":"Summary!E13","v":0},"7.3, Annex C",{"$nulls":5},"PMMA",110,3000,3.5,{"$nulls":7},"circle","C","IIa","B"]
["Diameter",{"$nulls":5},"d","mm",{"$f":"Summary!F13","v":0},"7.3, Annex C",{"$nulls":5},"PC",90,2400,3.5,{"$nulls":9},"IIb","C"]
["Curve height",{"$nulls":5},"c","mm",{"$f":"Summary!G13","v":0},"7.6",{"$nulls":5},"TG",200,72600,4,{"$nulls":9},"III","D"]
["Support SemiFixed / Simply Supported",{"$nulls":5},"SF / SS",null,{"$f":"Summary!H13","v":0},"3.18",{"$nulls":5},"CG",300,72600,4,{"$nulls":7},"semi-fixed","SF","IV",null,{"$f":"IF(I13=\"semi-fixed\",\"SF\",IF(I13=\"\",\"\",\"SS\"))","v":"SS"}]
["Location type",{"$nulls":5},"I/IIA/IIB/III/IV",null,{"$f":"Summary!I13","v":0},"3.17; Annex A",{"$nulls":5},"AG",40,72600,4,{"$nulls":7},"simply supported","SS"]
["Location area (only loc. III)",{"$nulls":5},"F / S / Any",null,{"$f":"Summary!J13","v":0},"3.17.4",{"$nulls":5},"AMPW",50,7000,2]
["Design Category",{"$nulls":5},"A / B / C / D",null,{"$f":"Summary!K13","v":0},"3.12",{"$nulls":5},"GRP M30",140,7500,2,{"$nulls":6},"any","front","F","Any","yes",{"$f":"IF(I15=\"front\",\"F\",IF(I15=\"side\",\"S\",IF(I15=\"any\",\"A\",\"\")))","v":""}]
["Craft Type Any/Motor/Sail",{"$nulls":5},"Any / M / S",null,{"$f":"Summary!L13","v":0},{"$nulls":6},"GRP M35",175,10000,2,{"$nulls":6},"motor","side","S","M","no"]
["Length of hull as in ISO 8666",{"$nulls":5},"LH","m",{"$f":"Summary!N13","v":{"v":0,"d":"0.00"}},"3.16",{"$nulls":5},"AL 5038",280,70000,2,{"$nulls":6},"sail","any","Any","S",null,{"$f":"IF(I17=\"any\",\"Any\",IF(I17=\"motor\",\"M\",IF(I17=\"sail\",\"S\",\"\")))","v":""}]
["Material data",{"$nulls":7},{"$f":"Summary!O13","v":0},"Table F.1 & 5",{"$nulls":5},"MS",400,200000,2]
[null,"  Ultimate flexural strength",{"$nulls":4},"σU","MPa",{"$f":"'main Side windows 5'!D18","v":{"$error":"#N/A"}},"Table F.1 & 5",{"$nulls":5},"AISI 316 L",510,200000,2]
[null,"  Modulus of elasticity",{"$nulls":4},"E","MPa",{"$f":"'main Side windows 5'!D19","v":{"$error":"#N/A"}},"Table F.1 & 5"]
[null,"  Safety factor",{"$nulls":4},"gamma",". / .",{"$f":"'main Side windows 5'!D20","v":{"$error":"#N/A"}},"Table F.1 & 5",{"$nulls":15},"yes"]
["Is actual plate a sandwich?",{"$nulls":5},"yes / no",null,{"$f":"Summary!Q13","v":0},"7.9",{"$nulls":5},{"$f":"IF(I23=\"YES\",\"The difference in thickness between any two glass plies must be less than or equal to 2 mm and the thickness of the plastic interlayer must be less than, or equal to 0,76 mm for these conditions !\",\"\")","v":""},{"$nulls":9},"no"]
[null,"If yes, enter number of layers",{"$nulls":5},". / .",{"$f":"Summary!R13","v":0},"7.9"]
["Actual plate thickness (in case of sandwich the sum of all layers)",{"$nulls":6},"mm",{"$f":"Summary!U13","v":{"v":0,"d":"0.00"}}]
[]
["Results for non-stiffened plates"]
["Press reduction factor",{"$nulls":5},"Ψ",". / .",{"$f":"'main Side windows 5'!D23","v":false},"7.5"]
["              within limits 0,33 and 1,0",{"$nulls":7},{"$f":"'main Side windows 5'!D24","v":1},"7.5",{"$nulls":5},"Table 5 — Safety factor and minimum thickness of monolithic plates"]
["Basic design press",{"$nulls":5},"p","kPa",{"$f":"'main Side windows 5'!D25","v":1},"7.4",{"$nulls":5},"Material","Acronym","Safety factor\n γ ","Minimum thickness of monolithic plates, tm"]
["Allowable flexural stress",{"$nulls":5},"σa","MPa",{"$f":"'main Side windows 5'!D26","v":{"$error":"#N/A"}},"7.8",{"$nulls":8},"Design categories "]
["Curvature coefficient",{"$nulls":5},"kC",". / .",{"$f":"'main Side windows 5'!D27","v":{"$error":"#DIV/0!"}},"7.6",{"$nulls":8},"Any",null,"A & B","C & D"]
["Ratio a/b (valid ≤ 5)",{"$nulls":6},". / .",{"$f":"'main Side windows 5'!D28","v":{"$error":"#DIV/0!"}},"7.3, Annex G.2",{"$nulls":8},"Area Ia","Area II","Area III & IV","Area III & IV"]
["Ratio a/b corrected",{"$nulls":6},". / .",{"$f":"'main Side windows 5'!D29","v":{"$error":"#DIV/0!"}},"7.3, Annex G.2",{"$nulls":5},"Poly(methyl)methacrylate","PMMA",3.5,"6+0,1(LH-4)",6,5,4]
["Plate aspect ratio coeff stress",{"$nulls":5},"kr",". / .",{"$f":"'main Side windows 5'!D30","v":"FALSCH"},"7.3, Annex G.2",{"$nulls":5},"Polycarbonate","PC",3.5,"6+0,1(LH-4)",6,5,4]
["Pate aspect ratio coeff deflection",{"$nulls":5},"kf",". / .",{"$f":"'main Side windows 5'!D31","v":false},"7.3, Annex G.2",{"$nulls":5},"Monolithic tempered glass ","TG",4,"5+0,1(LH-4)b",4,4,3]
[{"$nulls":15},"Laminated glass ","LG",4,"5+0,1(LH-4)b",4,4,3]
["Thickness (Stress)",{"$nulls":5},"tr","mm",{"$f":"'main Side windows 5'!D33","v":{"$error":"#DIV/0!"}},"7.1.1",{"$nulls":5},"All mahogany plywood ","AMPW",2,"8+0,1(LH-4)",6,5,4]
["Thickness (Deflection)",{"$nulls":5},"tf","mm",{"$f":"'main Side windows 5'!D34","v":{"$error":"#DIV/0!"}},"7.1.2",{"$nulls":5},"GRP mat 30 % glass ","GRP M30",2,"4+0,1(LH-4)",3,3,2]
["Thickness",{"$nulls":6},"mm",{"$f":"'main Side windows 5'!D35","v":{"$error":"#DIV/0!"}},{"$nulls":6},"GRP mat/roving 35 % glass ","GRP M35",2,"4+0,1(LH-4)",3,3,2]
["Thickness minimu, techn. ",{"$nulls":5},"tm","mm",{"$f":"'main Side windows 5'!D36","v":{"$error":"#DIV/0!"}},"7.8",{"$nulls":5},"Aluminium alloy 5083-H111 ","AL 5038",2,"3+0,05 (LH-4)",3,3,2]
["Thickness minimum, Tab 5",{"$nulls":6},"mm",{"$f":"'main Side windows 5'!D37","v":{"v":0,"d":"0.0"}},"Table 5",{"$nulls":5},"Mild steel ","MS",2,"2,5+0,025 (LH-4)",2.5,2.5,2]
[]
["Required plate thickness",{"$nulls":6},"mm",{"$f":"'main Side windows 5'!I31","v":{"$error":"#DIV/0!"}}]
["Requirements fullfilled?",{"$nulls":7},{"$f":"IF(L13=\"short side in area I max 300mm\",\"FAIL\",IF(I25>=I44,\"PASS\",\"FAIL\"))","v":{"$error":"#DIV/0!"}}]

{"sheet":"main Side windows 5","index":17,"n_rows":43,"n_cols":24,"rows_kept":43,"hidden":true,"merged":[[0,0,0,5],[1,0,1,5],[25,11,28,18],[26,6,26,7]]}
[{"$nulls":6},"manufacturer"]
[{"$nulls":6},"model name"]
["Eingabe","Version 1.2.2 / 15-03-2006 rev 060512/070507/dew 090918",{"$nulls":4},"ISO/FDIS 12216:2002(E)"]
["Parameter Input","SSign","Item/Unit",{"$nulls":18},"Lists"]
["form of plate Rectangular/Circle",null,"R/C",{"$f":"'Worksheet 5'!AE9","v":""},{"$f":"IF(D5=\"\",\"Input R oder C\",\"\")","v":"Input R oder C"},null,"Material Properties see table F.1 and Tab. 5",{"$nulls":14},"R","I","A"]
["long side","a","mm",{"$f":"'Worksheet 5'!I9","v":0},{"$f":"IF(AND(D5=\"R\",D6=\"\"),\"Input a requested\",IF(AND(D5=\"C\",D6=\"\"),\"Input d requested\",\"\"))","v":""},null,"Table F.1 mechanical properties [Mpa]",null,null,"Tab. 5",{"$nulls":11},"C","IIa","B"]
["unsupported short side","b","mm",{"$f":"'Worksheet 5'!I10","v":0},{"$f":"IF(AND(D5=\"R\",D7=\"\"),\"Input b requested\",IF(AND(D5=\"C\",D7=\"\"),\"Input d requested\",\"\"))","v":""},null,"Material","strength","elasticity","safety",{"$nulls":12},"IIb","C"]
["diameter","d","mm",{"$f":"'Worksheet 5'!I11","v":0},{"$f":"IF(AND(D5=\"C\",D8=\"\"),\"Input d requested\",\"\")","v":""},null,"PMMA",110,3000,3.5,{"$nulls":3},"AG",40,72600,4,{"$nulls":5},"III","D"]
["curve height","c","mm",{"$f":"'Worksheet 5'!I12","v":0},"optional",null,"PC",90,2400,3.5,{"$nulls":3},"AISI 316 L",510,200000,2,{"$nulls":4},"SF","IV"]
["support SemiFixed/Simple Supp.",null,"SF/SS",{"$f":"'Worksheet 5'!AE13","v":"SS"},{"$f":"IF(D10=\"\",\"Input SF or SS\",\"\")","v":""},null,"TG",200,72600,4,null,null,"6.1","AL 5038",280,70000,2,{"$nulls":4},"SS"]
["Location type",null,"I/IIA/IIB/III/IV",{"$f":"'Worksheet 5'!I14","v":{"v":0,"d":"0.00"}},{"$f":"IF(D11=\"\",\"Input I / IIa,b / III / IV\",\"\")","v":""},null,"CG",300,72600,4,null,null,"3.17.1-4","AMPW",50,7000,2]
["Location area (only loc. III)",null,"F/S/A",{"$f":"'Worksheet 5'!AE16","v":""},{"$f":"IF(D12=\"F\",\"\",IF(D12=\"S\",\"\",IF(D12=\"A\",\"\",IF(D11=\"III\",\"Input F / S / A\",\"\"))))","v":""},null,"AG",40,72600,4,{"$nulls":3},"CG",300,72600,4,{"$nulls":4},"F","Any","yes"]
["Design Category",null,"A/B/C/D",{"$f":"IF('Worksheet 5'!I16=\"\",\"\",'Worksheet 5'!I16)","v":{"v":0,"d":"0.00"}},{"$f":"IF(D13=\"\",\"Input A / B / C / D\",\"\")","v":""},null,"AMPW",50,7000,2,{"$nulls":3},"GRP M30",140,7500,2,{"$nulls":4},"S","M","no"]
["Craft Type Any/Motor/Sail",null,"Any/M/S",{"$f":"'Worksheet 5'!AE18","v":""},{"$f":"IF(D14=\"\",\"Input Any / M / S\",\"\")","v":"Input Any / M / S"},null,"GRP M30",140,7500,2,{"$nulls":3},"GRP M35",175,10000,2,{"$nulls":4},"A","S"]
["optional: craft length of hull",null,"m",{"$f":"'Worksheet 5'!I18","v":{"v":0,"d":"0.00"}},"default, change if smaller",null,"GRP M35",175,10000,2,{"$nulls":3},"MS",400,200000,2]
[{"$nulls":6},"AL 5038",280,70000,2,{"$nulls":3},"PC",90,2400,3.5]
["Material",null,"see Tab. F.1",{"$f":"'Worksheet 5'!I19","v":{"v":0,"d":"0.00"}},{"$f":"IF(D17=\"\",\"manual input requ\",\"\")","v":""},null,"MS",400,200000,2,{"$nulls":3},"PMMA",110,3000,3.5]
["  ultimate flexural strength","Sigma u",null,{"$f":"LOOKUP(D17,N8:N18,O8:O18)","v":{"$error":"#N/A"}},"falls nicht in F.1 ",null,"AISI 316 L",510,200000,2,{"$nulls":3},"TG",200,72600,4]
["  modulus of elasticity","E",null,{"$f":"LOOKUP(D17,N8:N18,P8:P18)","v":{"$error":"#N/A"}},"Werte manuell"]
["  safety factor","gamma",null,{"$f":"LOOKUP(D17,N8:N18,Q8:Q18)","v":{"$error":"#N/A"}},"eintragen"]
[]
["Results for non-stiffened plates"]
["press reduction factor",null,null,{"$f":"IF(D5=\"R\",1.102-0.0004*D7,IF(D5=\"C\",1.102-0.0004*D8))","v":false},"(7.5)"]
["              within limits 0,33 and 1,0","psi",null,{"$f":"IF(D23<0.33,0.33,IF(D23>1,1,D23))","v":{"v":1,"d":"1.000"}},"(7.5)"]
["basic design press","p","KPa",{"$f":"'basic design pressure 5'!G43","v":{"v":1,"d":"1.00"}},"(7.4)",null,"see work sheet \"basic design press\""]
["allowable flexural stress","Sigma a","MPa",{"$f":"D18/D20","v":{"$error":"#N/A"}},"(7.8)",null,"is actual plate a sandwich?",null,{"$f":"'Worksheet 5'!I23","v":0},null,null,{"$f":"IF(I26=\"YES\",\"the difference in thickness between any two glass plies must be less than or equal to 2 mm and the thickness of the plastic interlayer must be less than, or equal to 0,76 mm for these conditions !\",\"\")","v":""}]
["curvature coefficient","kc",null,{"$f":"IF(D5=\"C\",1-(D9/D8),1-(D9/D7))","v":{"$error":"#DIV/0!"}},"(7.6)",null,{"$f":"IF(I26=\"yes\", \"number of layers?\",\"\")","v":""},null,{"$f":"IF('Worksheet 5'!I24=\"\",\"\",'Worksheet 5'!I24)","v":0}]
["              a/b real  (valid ≤ 5)",null,null,{"$f":"IF(D5=\"C\",1,D6/D7)","v":{"$error":"#DIV/0!"}},"(7.3) Annex G.2"]
["              a/b corrected",null,null,{"$f":"IF(D28>5,5,D28)","v":{"$error":"#DIV/0!"}},"(7.3) Annex G.2"]
["plate aspect ratio coeff stress","kr",null,{"$f":"IF(D5=\"R\",IF(D10=\"SF\",(0.62165*D29^2-0.6473*D29+0.26481)/(D29^2-1.173*D29+0.97671),IF(D10=\"SS\",(0.69952*D29^2+0.02662*D29-0.0735)/(D29^2-0.7185*D29+1.98925),\"Fehler\")),IF(D5=\"C\",IF(D10=\"SF\",0.248,0.309),\"FALSCH\"))","v":"FALSCH"},"(7.3) Annex G.2",null,"actual plate Thickness",null,{"$f":"'Worksheet 5'!I25","v":0},"mm",null,{"$f":"IF(I26=\"yes\", \"=sum of all plies\",\"\")","v":""}]
["pate aspect ratio coeff deflection","kf",null,{"$f":"IF(D5=\"R\",IF(D10=\"SF\",(0.08052*D29^2-0.0272*D29-0.0019)/(D29^2-0.9275*D29+1.70018),IF(D10=\"SS\",(0.12915*D29^2+0.00868*D29-0.0293)/(D29^2-0.887*D29+2.3372),\"Fehler\")),IF(D5=\"C\",IF(D10=\"SF\",0.027,0.043)))","v":false},"(7.3) Annex G.2",null,"required plate thickness",null,{"$f":"IF(AND(I26=\"Yes\",I27=\"\"),\"please enter number of layers\",IF(AND(I26=\"Yes\",I27>2),1.5*MAX(D35:D37),IF(AND(I26=\"Yes\",I27=2),1.2*MAX(D35:D37),IF(I36=\"Yes\",MAX(D36:D37),MAX(D35:D37)))))","v":{"$error":"#DIV/0!"}}]
[{"$nulls":6},"requirements fulfilled?",null,{"$f":"IF(I30=\"\",\"\",IF(I30>=I31,\"PASS\",\"FAIL\"))","v":{"$error":"#DIV/0!"}}]
["Thickness (Stress)","tr","mm",{"$f":"IF(D5=\"C\",D8*D27*SQRT(D30*D24*D25/D26/1000),D7*D27*SQRT(D30*D24*D25/D26/1000))","v":{"$error":"#DIV/0!"}},"(7.1.1)"]
["Thickness (Deflection)","tf","mm",{"$f":"0.45*(D33+D7*D27*POWER((D31*D24*D25/0.02/D19/1000),0.33333))","v":{"$error":"#DIV/0!"}},"(7.1.2)"]
["Thickness",null,null,{"$f":"ROUND(MAX(D33:D34),2)","v":{"$error":"#DIV/0!"}},"(7.1.7)",{"$nulls":3},"Minimum tech used???"]
["Thickness minimu, techn. ",null,"mm",{"$f":"D35-0.5","v":{"$error":"#DIV/0!"}},null,null," = Minimum, absolute",null,{"$f":"Summary!P13","v":0}]
["Thickness minimum, Tab 5","tm","mm",{"$f":"'basic design pressure 5'!J48","v":{"v":0,"d":"0.0"}},"(Tab. 5)",null,"(only PMMA, PC, TG, LG)"]
[]
["Escape Hatch possible ?"]
["Required ISO 9094-1, 2"]
["Circular: inner Diam > 450 mm",null,null,{"$f":"IF(D5=\"C\",IF(D8>450,\"pass\",\"fail\"),\"n.a.\")","v":"n.a."}]
["Rectang: inner Diam > 380 mm",null,null,{"$f":"IF(D5=\"R\",IF(MAX(D6:D7)>380,\"pass\",\"fail\"),\"n.a.\")","v":"n.a."}]
["              Area > 180000 mm²",null,null,{"$f":"IF(D5=\"R\",IF(D6*D7>180000,\"pass\",\"fail\"),\"n.a.\")","v":"n.a."}]

{"sheet":"basic design pressure 5","index":18,"n_rows":193,"n_cols":10,"rows_kept":193,"hidden":true}
["Basic design pressure",null,null,"(7.4 Table 4)"]
[]
["location",null,{"$f":"'main Side windows 5'!D11","v":0}]
["particular",null,{"$f":"IF(AND(C5=\"C\",C6=\"M\",C3=\"III\"),\"A\",'main Side windows 5'!D12)","v":""},null,"Remark: f=front, s=side"]
["design cat",null,{"$f":"'main Side windows 5'!D13","v":0}]
["craft type",null,{"$f":"'main Side windows 5'!D14","v":""},{"$f":"IF(C6=\"Any\",\"S\",C6)","v":""},"Remark: if craft type = Any, set craft type = S"]
[]
[]
["Tabelle 4",null,"location","craft type","design cat","particular","pressure"]
[null,null,"I","Any","Any","Any",70]
[null,null,"IIB","Any","A","Any",70]
[null,null,"IIB","Any","B","Any",50]
[null,null,"IIB","Any","C","Any",28]
[null,null,"IIB","Any","D","Any",28]
[null,null,"IIA","Any","Any","Any",28]
[null,null,"III","S","A","Any",18]
[null,null,"III","S","B","Any",18]
[null,null,"III","S","C","Any",12]
[null,null,"III","S","D","Any",12]
[null,null,"III","M","A","Front",12]
[null,null,"III","M","A","Any",12]
[null,null,"III","M","B","Front",9]
[null,null,"III","M","B","Any",9]
[null,null,"III","M","D","Front",6,null,null,"Korrektur, Zeile eingefügt um Fehler bei eingabe III, M, Front, D zu beheben"]
[null,null,"III","M","A","Side",9]
[null,null,"III","M","B","Side",6]
[null,null,"III","M","C","Any",6]
[null,null,"III","M","D","Any",6]
[null,null,"IV","S","Any","Any",12]
[null,null,"IV","M","Any","Any",6]
[]
["Ergebnis"]
[null,"location = I",{"$nulls":4},{"$f":"IF(C3=\"I\",G10,0)","v":0}]
[null,"location = IIB",{"$nulls":4},{"$f":"IF(C3=\"IIB\",VLOOKUP(C5,E11:G15,3),0)","v":0}]
[null,"location = IIA",{"$nulls":4},{"$f":"IF(C3=\"IIA\",VLOOKUP(C3,E11:G15,3),0)","v":0}]
[null,"location = III","craft = S",{"$nulls":3},{"$f":"IF(AND(C3=\"III\",D6=\"S\"),VLOOKUP(C5,E16:G19,3),0)","v":0}]
[null,"location = III","craft = M","particular = front",null,null,{"$f":"IF(AND(C3=\"III\",D6=\"M\",C4=\"F\"),VLOOKUP(C5,E20:G24,3),0)","v":0}]
[null,"location = III","craft = M","particular = any",null,null,{"$f":"IF(AND(OR(C5=\"A\",C5=\"B\"),C3=\"III\",D6=\"M\",C4=\"A\"),VLOOKUP(C5,E20:G24,3),0)","v":0}]
[null,"location = III","craft = M","particular = side",null,null,{"$f":"IF(AND(C3=\"III\",C6=\"M\",C4=\"S\"),IF(C5=\"A\",9,IF(C5=\"B\",6,0)))","v":false}]
[null,"location = III","craft = M",{"$nulls":3},{"$f":"IF(C5=\"A\",0,IF(C5=\"B\",0,IF(AND(C3=\"III\",C6=\"M\"),VLOOKUP(C5,E27:G28,3))))","v":false}]
[null,"location = IV",{"$nulls":4},{"$f":"IF(C3=\"IV\",VLOOKUP(D6,D29:G30,4,0),1)","v":1}]
[]
["pressure",{"$nulls":5},{"$f":"MAX(G33:G41)","v":1}]
[]
[]
["minimum thickness"]
[]
[null,"Area",{"$f":"IF(OR('main Side windows 5'!D11=\"IIA\",'main Side windows 5'!D11=\"IIB\"),\"II\",'main Side windows 5'!D11)","v":0},{"$nulls":4},"minimum thickness",null,{"$f":"MAX(J50:J190)","v":0}]
[]
[null,null,"PMMA","A","I",{"$f":" IF('main Side windows 5'!$D$15>0,6 + 0.1*('main Side windows 5'!$D$15-4),\"\")","v":""},{"$nulls":3},{"$f":"IF('main Side windows 5'!$D$17=\"PMMA\",(IF('main Side windows 5'!$D$13=\"A\",VLOOKUP($C$48,$E$50:$F$53,2,-1),0)),0)","v":0}]
["Table 5",{"$nulls":3},"II",6]
[{"$nulls":4},"III",5]
[{"$nulls":4},"IV",5]
[null,null,"PMMA","B","I",{"$f":" IF('main Side windows 5'!$D$15>0,6 + 0.1*('main Side windows 5'!$D$15-4),\"\")","v":""},{"$nulls":3},{"$f":"IF('main Side windows 5'!$D$17=\"PMMA\",(IF('main Side windows 5'!$D$13=\"B\",VLOOKUP($C$48,$E$54:$F$57,2,-1),0)),0)","v":0}]
[{"$nulls":4},"II",6]
[{"$nulls":4},"III",5]
[{"$nulls":4},"IV",5]
[null,null,"PMMA","C","I",{"$f":" IF('main Side windows 5'!$D$15>0,6 + 0.1*('main Side windows 5'!$D$15-4),\"\")","v":""},{"$nulls":3},{"$f":"IF('main Side windows 5'!$D$17=\"PMMA\",(IF('main Side windows 5'!$D$13=\"C\",VLOOKUP($C$48,$E$58:$F$61,2,-1),0)),0)","v":0}]
[{"$nulls":4},"II",6]
[{"$nulls":4},"III",4]
[{"$nulls":4},"IV",4]
[null,null,"PMMA","D","I",{"$f":" IF('main Side windows 5'!$D$15>0,6 + 0.1*('main Side windows 5'!$D$15-4),\"\")","v":""},{"$nulls":3},{"$f":"IF('main Side windows 5'!$D$17=\"PMMA\",(IF('main Side windows 5'!$D$13=\"D\",VLOOKUP($C$48,E62:F65,2,-1),0)),0)","v":0}]
[{"$nulls":4},"II",6]
[{"$nulls":4},"III",4]
[{"$nulls":4},"IV",4]
[null,null,"PC","A","I",{"$f":" IF('main Side windows 5'!$D$15>0,6 + 0.1*('main Side windows 5'!$D$15-4),\"\")","v":""},{"$nulls":3},{"$f":"IF('main Side windows 5'!$D$17=\"PC\",(IF('main Side windows 5'!$D$13=\"A\",VLOOKUP($C$48,E66:F69,2,-1),0)),0)","v":0}]
[{"$nulls":4},"II",6]
[{"$nulls":4},"III",5]
[{"$nulls":4},"IV",5]
[null,null,"PC","B","I",{"$f":" IF('main Side windows 5'!$D$15>0,6 + 0.1*('main Side windows 5'!$D$15-4),\"\")","v":""},{"$nulls":3},{"$f":"IF('main Side windows 5'!$D$17=\"PC\",(IF('main Side windows 5'!$D$13=\"B\",VLOOKUP($C$48,E70:F73,2,-1),0)),0)","v":0}]
[{"$nulls":4},"II",6]
[{"$nulls":4},"III",5]
[{"$nulls":4},"IV",5]
[null,null,"PC","C","I",{"$f":" IF('main Side windows 5'!$D$15>0,6 + 0.1*('main Side windows 5'!$D$15-4),\"\")","v":""},{"$nulls":3},{"$f":"IF('main Side windows 5'!$D$17=\"PC\",(IF('main Side windows 5'!$D$13=\"C\",VLOOKUP($C$48,E74:F77,2,-1),0)),0)","v":0}]
[{"$nulls":4},"II",6]
[{"$nulls":4},"III",4]
[{"$nulls":4},"IV",4]
[null,null,"PC","D","I",{"$f":" IF('main Side windows 5'!$D$15>0,6 + 0.1*('main Side windows 5'!$D$15-4),\"\")","v":""},{"$nulls":3},{"$f":"IF('main Side windows 5'!$D$17=\"PC\",(IF('main Side windows 5'!$D$13=\"D\",VLOOKUP($C$48,E78:F81,2,-1),0)),0)","v":0}]
[{"$nulls":4},"II",6]
[{"$nulls":4},"III",4]
[{"$nulls":4},"IV",4]
[null,null,"TG","A","I",{"$f":" IF('main Side windows 5'!$D$15>0,5+ 0.1*('main Side windows 5'!$D$15-4),\"\")","v":""},{"$nulls":3},{"$f":"IF('main Side windows 5'!$D$17=\"TG\",(IF('main Side windows 5'!$D$13=\"A\",VLOOKUP($C$48,E82:F85,2,-1),0)),0)","v":0}]
[{"$nulls":4},"II",4]
[{"$nulls":4},"III",4]
[{"$nulls":4},"IV",4]
[null,null,"TG","B","I",{"$f":" IF('main Side windows 5'!$D$15>0,5+ 0.1*('main Side windows 5'!$D$15-4),\"\")","v":""},{"$nulls":3},{"$f":"IF('main Side windows 5'!$D$17=\"TG\",(IF('main Side windows 5'!$D$13=\"B\",VLOOKUP($C$48,E86:F89,2,-1),0)),0)","v":0}]
[{"$nulls":4},"II",4]
[{"$nulls":4},"III",4]
[{"$nulls":4},"IV",4]
[null,null,"TG","C","I",{"$f":" IF('main Side windows 5'!$D$15>0,5+ 0.1*('main Side windows 5'!$D$15-4),\"\")","v":""},{"$nulls":3},{"$f":"IF('main Side windows 5'!$D$17=\"TG\",(IF('main Side windows 5'!$D$13=\"C\",VLOOKUP($C$48,E90:F93,2,-1),0)),0)","v":0}]
[{"$nulls":4},"II",4]
[{"$nulls":4},"III",3]
[{"$nulls":4},"IV",3]
[null,null,"TG","D","I",{"$f":" IF('main Side windows 5'!$D$15>0,5+ 0.1*('main Side windows 5'!$D$15-4),\"\")","v":""},{"$nulls":3},{"$f":"IF('main Side windows 5'!$D$17=\"TG\",(IF('main Side windows 5'!$D$13=\"D\",VLOOKUP($C$48,E94:F97,2,-1),0)),0)","v":0}]
[{"$nulls":4},"II",4]
[{"$nulls":4},"III",3]
[{"$nulls":4},"IV",3]
[null,null,"LG","A","I",{"$f":" IF('main Side windows 5'!$D$15>0,5+ 0.1*('main Side windows 5'!$D$15-4),\"\")","v":""},{"$nulls":3},{"$f":"IF('main Side windows 5'!$D$17=\"LG\",(IF('main Side windows 5'!$D$13=\"A\",VLOOKUP($C$48,E98:F101,2,-1),0)),0)","v":0}]
[{"$nulls":4},"II",4]
[{"$nulls":4},"III",4]
[{"$nulls":4},"IV",4]
[null,null,"LG","B","I",{"$f":" IF('main Side windows 5'!$D$15>0,5+ 0.1*('main Side windows 5'!$D$15-4),\"\")","v":""},{"$nulls":3},{"$f":"IF('main Side windows 5'!$D$17=\"LG\",(IF('main Side windows 5'!$D$13=\"B\",VLOOKUP($C$48,E102:F105,2,-1),0)),0)","v":0}]
[{"$nulls":4},"II",4]
[{"$nulls":4},"III",4]
[{"$nulls":4},"IV",4]
[null,null,"LG","C","I",{"$f":" IF('main Side windows 5'!$D$15>0,5+ 0.1*('main Side windows 5'!$D$15-4),\"\")","v":""},{"$nulls":3},{"$f":"IF('main Side windows 5'!$D$17=\"LG\",(IF('main Side windows 5'!$D$13=\"C\",VLOOKUP($C$48,E106:F109,2,-1),0)),0)","v":0}]
[{"$nulls":4},"II",4]
[{"$nulls":4},"III",3]
[{"$nulls":4},"IV",3]
[null,null,"LG","D","I",{"$f":" IF('main Side windows 5'!$D$15>0,5+ 0.1*('main Side windows 5'!$D$15-4),\"\")","v":""},{"$nulls":3},{"$f":"IF('main Side windows 5'!$D$17=\"LG\",(IF('main Side windows 5'!$D$13=\"D\",VLOOKUP($C$48,E110:F113,2,-1),0)),0)","v":0}]
[{"$nulls":4},"II",4]
[{"$nulls":4},"III",3]
[{"$nulls":4},"IV",3]
[null,null,"AMPW","A","I",{"$f":" IF('main Side windows 5'!$D$15>0,8+ 0.1*('main Side windows 5'!$D$15-4),\"\")","v":""},{"$nulls":3},{"$f":"IF('main Side windows 5'!$D$17=\"AMPW\",(IF('main Side windows 5'!$D$13=\"A\",VLOOKUP($C$48,E114:F117,2,-1),0)),0)","v":0}]
[{"$nulls":4},"II",6]
[{"$nulls":4},"III",5]
[{"$nulls":4},"IV",5]
[null,null,"AMPW","B","I",{"$f":" IF('main Side windows 5'!$D$15>0,8+ 0.1*('main Side windows 5'!$D$15-4),\"\")","v":""},{"$nulls":3},{"$f":"IF('main Side windows 5'!$D$17=\"AMPW\",(IF('main Side windows 5'!$D$13=\"B\",VLOOKUP($C$48,E118:F121,2,-1),0)),0)","v":0}]
[{"$nulls":4},"II",6]
[{"$nulls":4},"III",5]
[{"$nulls":4},"IV",5]
[null,null,"AMPW","C","I",{"$f":" IF('main Side windows 5'!$D$15>0,8+ 0.1*('main Side windows 5'!$D$15-4),\"\")","v":""},{"$nulls":3},{"$f":"IF('main Side windows 5'!$D$17=\"AMPW\",(IF('main Side windows 5'!$D$13=\"C\",VLOOKUP($C$48,E122:F125,2,-1),0)),0)","v":0}]
[{"$nulls":4},"II",6]
[{"$nulls":4},"III",4]
[{"$nulls":4},"IV",4]
[null,null,"AMPW","D","I",{"$f":" IF('main Side windows 5'!$D$15>0,8+ 0.1*('main Side windows 5'!$D$15-4),\"\")","v":""},{"$nulls":3},{"$f":"IF('main Side windows 5'!$D$17=\"AMPW\",(IF('main Side windows 5'!$D$13=\"D\",VLOOKUP($C$48,E126:F129,2,-1),0)),0)","v":0}]
[{"$nulls":4},"II",6]
[{"$nulls":4},"III",4]
[{"$nulls":4},"IV",4]
[null,null,"GRP m30","A","I",{"$f":" IF('main Side windows 5'!$D$15>0,4 + 0.1*('main Side windows 5'!$D$15-4),\"\")","v":""},{"$nulls":3},{"$f":"IF('main Side windows 5'!$D$17=\"GRP M30\",(IF('main Side windows 5'!$D$13=\"A\",VLOOKUP($C$48,E130:F133,2,-1),0)),0)","v":0}]
[{"$nulls":4},"II",3]
[{"$nulls":4},"III",3]
[{"$nulls":4},"IV",3]
[null,null,"GRP m30","B","I",{"$f":" IF('main Side windows 5'!$D$15>0,4 + 0.1*('main Side windows 5'!$D$15-4),\"\")","v":""},{"$nulls":3},{"$f":"IF('main Side windows 5'!$D$17=\"GRP M30\",(IF('main Side windows 5'!$D$13=\"B\",VLOOKUP($C$48,E134:F137,2,-1),0)),0)","v":0}]
[{"$nulls":4},"II",3]
[{"$nulls":4},"III",3]
[{"$nulls":4},"IV",3]
[null,null,"GRP m30","C","I",{"$f":" IF('main Side windows 5'!$D$15>0,4 + 0.1*('main Side windows 5'!$D$15-4),\"\")","v":""},{"$nulls":3},{"$f":"IF('main Side windows 5'!$D$17=\"GRP M30\",(IF('main Side windows 5'!$D$13=\"C\",VLOOKUP($C$48,E138:F141,2,-1),0)),0)","v":0}]
[{"$nulls":4},"II",3]
[{"$nulls":4},"III",2]
[{"$nulls":4},"IV",2]
[null,null,"GRP m30","D","I",{"$f":" IF('main Side windows 5'!$D$15>0,4 + 0.1*('main Side windows 5'!$D$15-4),\"\")","v":""},{"$nulls":3},{"$f":"IF('main Side windows 5'!$D$17=\"GRP M30\",(IF('main Side windows 5'!$D$13=\"D\",VLOOKUP($C$48,E142:F145,2,-1),0)),0)","v":0}]
[{"$nulls":4},"II",3]
[{"$nulls":4},"III",2]
[{"$nulls":4},"IV",2]
[null,null,"GRP m35","A","I",{"$f":" IF('main Side windows 5'!$D$15>0,4 + 0.1*('main Side windows 5'!$D$15-4),\"\")","v":""},{"$nulls":3},{"$f":"IF('main Side windows 5'!$D$17=\"GRP M35\",(IF('main Side windows 5'!$D$13=\"A\",VLOOKUP($C$48,E146:F149,2,-1),0)),0)","v":0}]
[{"$nulls":4},"II",3]
[{"$nulls":4},"III",3]
[{"$nulls":4},"IV",3]
[null,null,"GRP m35","B","I",{"$f":" IF('main Side windows 5'!$D$15>0,4 + 0.1*('main Side windows 5'!$D$15-4),\"\")","v":""},{"$nulls":3},{"$f":"IF('main Side windows 5'!$D$17=\"GRP M35\",(IF('main Side windows 5'!$D$13=\"B\",VLOOKUP($C$48,E150:F153,2,-1),0)),0)","v":0}]
[{"$nulls":4},"II",3]
[{"$nulls":4},"III",3]
[{"$nulls":4},"IV",3]
[null,null,"GRP m35","C","I",{"$f":" IF('main Side windows 5'!$D$15>0,4 + 0.1*('main Side windows 5'!$D$15-4),\"\")","v":""},{"$nulls":3},{"$f":"IF('main Side windows 5'!$D$17=\"GRP M35\",(IF('main Side windows 5'!$D$13=\"C\",VLOOKUP($C$48,E154:F157,2,-1),0)),0)","v":0}]
[{"$nulls":4},"II",3]
[{"$nulls":4},"III",2]
[{"$nulls":4},"IV",2]
[null,null,"GRP m35","D","I",{"$f":" IF('main Side windows 5'!$D$15>0,4 + 0.1*('main Side windows 5'!$D$15-4),\"\")","v":""},{"$nulls":3},{"$f":"IF('main Side windows 5'!$D$17=\"GRP M35\",(IF('main Side windows 5'!$D$13=\"D\",VLOOKUP($C$48,E158:F161,2,-1),0)),0)","v":0}]
[{"$nulls":4},"II",3]
[{"$nulls":4},"III",2]
[{"$nulls":4},"IV",2]
[null,null,"Al 5038","A","I",{"$f":" IF('main Side windows 5'!$D$15>0,3 + 0.05*('main Side windows 5'!$D$15-4),\"\")","v":""},{"$nulls":3},{"$f":"IF('main Side windows 5'!$D$17=\"Al 5038\",(IF('main Side windows 5'!$D$13=\"A\",VLOOKUP($C$48,E162:F165,2,-1),0)),0)","v":0}]
[{"$nulls":4},"II",3]
[{"$nulls":4},"III",3]
[{"$nulls":4},"IV",3]
[null,null,"Al 5038","B","I",{"$f":" IF('main Side windows 5'!$D$15>0,3 + 0.05*('main Side windows 5'!$D$15-4),\"\")","v":""},{"$nulls":3},{"$f":"IF('main Side windows 5'!$D$17=\"AL 5038\",(IF('main Side windows 5'!$D$13=\"B\",VLOOKUP($C$48,E166:F169,2,-1),0)),0)","v":0}]
[{"$nulls":4},"II",3]
[{"$nulls":4},"III",3]
[{"$nulls":4},"IV",3]
[null,null,"Al 5038","C","I",{"$f":" IF('main Side windows 5'!$D$15>0,3 + 0.05*('main Side windows 5'!$D$15-4),\"\")","v":""},{"$nulls":3},{"$f":"IF('main Side windows 5'!$D$17=\"AL 5038\",(IF('main Side windows 5'!$D$13=\"C\",VLOOKUP($C$48,E170:F173,2,-1),0)),0)","v":0}]
[{"$nulls":4},"II",3]
[{"$nulls":4},"III",2]
[{"$nulls":4},"IV",2]
[null,null,"Al 5038","D","I",{"$f":" IF('main Side windows 5'!$D$15>0,3 + 0.05*('main Side windows 5'!$D$15-4),\"\")","v":""},{"$nulls":3},{"$f":"IF('main Side windows 5'!$D$17=\"AL 5038\",(IF('main Side windows 5'!$D$13=\"D\",VLOOKUP($C$48,E174:F177,2,-1),0)),0)","v":0}]
[{"$nulls":4},"II",3]
[{"$nulls":4},"III",2]
[{"$nulls":4},"IV",2]
[null,null,"MS","A","I",{"$f":" IF('main Side windows 5'!$D$15>0,2.5 + 0.025*('main Side windows 5'!$D$15-4),\"\")","v":""},{"$nulls":3},{"$f":"IF('main Side windows 5'!$D$17=\"MS\",(IF('main Side windows 5'!$D$13=\"A\",VLOOKUP($C$48,E178:F181,2,-1),0)),0)","v":0}]
[{"$nulls":4},"II",2.5]
[{"$nulls":4},"III",2.5]
[{"$nulls":4},"IV",2.5]
[null,null,"MS","B","I",{"$f":" IF('main Side windows 5'!$D$15>0,2.5 + 0.025*('main Side windows 5'!$D$15-4),\"\")","v":""},{"$nulls":3},{"$f":"IF('main Side windows 5'!$D$17=\"MS\",(IF('main Side windows 5'!$D$13=\"B\",VLOOKUP($C$48,E182:F185,2,-1),0)),0)","v":0}]
[{"$nulls":4},"II",2.5]
[{"$nulls":4},"III",2.5]
[{"$nulls":4},"IV",2.5]
[null,null,"MS","C","I",{"$f":" IF('main Side windows 5'!$D$15>0,2.5 + 0.025*('main Side windows 5'!$D$15-4),\"\")","v":""},{"$nulls":3},{"$f":"IF('main Side windows 5'!$D$17=\"MS\",(IF('main Side windows 5'!$D$13=\"C\",VLOOKUP($C$48,E186:F189,2,-1),0)),0)","v":0}]
[{"$nulls":4},"II",2.5]
[{"$nulls":4},"III",2]
[{"$nulls":4},"IV",2]
[null,null,"MS","D","I",{"$f":" IF('main Side windows 5'!$D$15>0,2.5 + 0.025*('main Side windows 5'!$D$15-4),\"\")","v":""},{"$nulls":3},{"$f":"IF('main Side windows 5'!$D$17=\"MS\",(IF('main Side windows 5'!$D$13=\"D\",VLOOKUP($C$48,E190:F193,2,-1),0)),0)","v":0}]
[{"$nulls":4},"II",2.5]
[{"$nulls":4},"III",2]
[{"$nulls":4},"IV",2]

{"sheet":"Worksheet 6","index":19,"n_rows":45,"n_cols":31,"rows_kept":45,"merged":[[0,0,0,9],[0,11,0,12],[1,0,1,9],[2,0,2,9],[4,0,4,9],[6,0,6,5],[17,13,17,14],[19,13,19,14],[21,12,21,14],[22,15,26,18],[27,6,28,6],[27,7,28,7],[27,15,27,21],[29,15,32,15],[29,16,32,16],[29,17,32,17],[29,18,29,21],[30,18,30,21],[31,18,31,19],[32,11,32,13],[34,13,34,14],[36,13,36,14],[38,13,38,14],[39,13,39,14],[41,13,41,14]]}
[{"$nulls":11},"Comments"]
["ISO 12216:2020 - Small craft - Windows, portlights, hatches, deadlights and doors",{"$nulls":11},"Derived values"]
["WORKSHEET No. 1 data entry",{"$nulls":11},"Input values"]
[]
[{"$f":"CONCATENATE(coverSheet!B5,\"   \",coverSheet!B12,\"   \",Summary!B14)","v":"      "}]
[]
["Parameter",{"$nulls":5},"Symbol","Unit","Value","Ref.",{"$nulls":5},"Material Properties see table F.1 and Tab. 5",{"$nulls":11},"List"]
["Form of plate (Rectangular / Circle)",{"$nulls":5},"R / C",null,{"$f":"Summary!C14","v":0},"Annex C",{"$nulls":5},"Table F.1 mechanical properties [MPa]",null,null,"Tab. 5",{"$nulls":8},"Lists"]
["Long side",{"$nulls":5},"a","mm",{"$f":"Summary!D14","v":0},"7.3, Annex C",{"$nulls":5},"Material","strength","elasticity","safety",{"$nulls":7},"rectangular","R","I","A",{"$f":"IF(I8=\"rectangular\",\"R\",IF(I8=\"circle\",\"C\",\"\"))","v":""}]
["Unsupported short side",{"$nulls":5},"b","mm",{"$f":"Summary!E14","v":0},"7.3, Annex C",{"$nulls":5},"PMMA",110,3000,3.5,{"$nulls":7},"circle","C","IIa","B"]
["Diameter",{"$nulls":5},"d","mm",{"$f":"Summary!F14","v":0},"7.3, Annex C",{"$nulls":5},"PC",90,2400,3.5,{"$nulls":9},"IIb","C"]
["Curve height",{"$nulls":5},"c","mm",{"$f":"Summary!G14","v":0},"7.6",{"$nulls":5},"TG",200,72600,4,{"$nulls":9},"III","D"]
["Support SemiFixed / Simply Supported",{"$nulls":5},"SF / SS",null,{"$f":"Summary!H14","v":0},"3.18",{"$nulls":5},"CG",300,72600,4,{"$nulls":7},"semi-fixed","SF","IV",null,{"$f":"IF(I13=\"semi-fixed\",\"SF\",IF(I13=\"\",\"\",\"SS\"))","v":"SS"}]
["Location type",{"$nulls":5},"I/IIA/IIB/III/IV",null,{"$f":"Summary!I14","v":0},"3.17; Annex A",{"$nulls":5},"AG",40,72600,4,{"$nulls":7},"simply supported","SS"]
["Location area (only loc. III)",{"$nulls":5},"F / S / Any",null,{"$f":"Summary!J14","v":0},"3.17.4",{"$nulls":5},"AMPW",50,7000,2]
["Design Category",{"$nulls":5},"A / B / C / D",null,{"$f":"Summary!K14","v":0},"3.12",{"$nulls":5},"GRP M30",140,7500,2,{"$nulls":6},"any","front","F","Any","yes",{"$f":"IF(I15=\"front\",\"F\",IF(I15=\"side\",\"S\",IF(I15=\"any\",\"A\",\"\")))","v":""}]
["Craft Type Any/Motor/Sail",{"$nulls":5},"Any / M / S",null,{"$f":"Summary!L14","v":0},{"$nulls":6},"GRP M35",175,10000,2,{"$nulls":6},"motor","side","S","M","no"]
["Length of hull as in ISO 8666",{"$nulls":5},"LH","m",{"$f":"Summary!N14","v":{"v":0,"d":"0.00"}},"3.16",{"$nulls":5},"AL 5038",280,70000,2,{"$nulls":6},"sail","any","Any","S",null,{"$f":"IF(I17=\"any\",\"Any\",IF(I17=\"motor\",\"M\",IF(I17=\"sail\",\"S\",\"\")))","v":""}]
["Material data",{"$nulls":7},{"$f":"Summary!O14","v":0},"Table F.1 & 5",{"$nulls":5},"MS",400,200000,2]
[null,"  Ultimate flexural strength",{"$nulls":4},"σU","MPa",{"$f":"'main Side windows 6'!D18","v":{"$error":"#N/A"}},"Table F.1 & 5",{"$nulls":5},"AISI 316 L",510,200000,2]
[null,"  Modulus of elasticity",{"$nulls":4},"E","MPa",{"$f":"'main Side windows 6'!D19","v":{"$error":"#N/A"}},"Table F.1 & 5"]
[null,"  Safety factor",{"$nulls":4},"gamma",". / .",{"$f":"'main Side windows 6'!D20","v":{"$error":"#N/A"}},"Table F.1 & 5",{"$nulls":15},"yes"]
["Is actual plate a sandwich?",{"$nulls":5},"yes / no",null,{"$f":"Summary!Q14","v":0},"7.9",{"$nulls":5},{"$f":"IF(I23=\"YES\",\"The difference in thickness between any two glass plies must be less than or equal to 2 mm and the thickness of the plastic interlayer must be less than, or equal to 0,76 mm for these conditions !\",\"\")","v":""},{"$nulls":9},"no"]
[null,"If yes, enter number of layers",{"$nulls":5},". / .",{"$f":"Summary!R14","v":0},"7.9"]
["Actual plate thickness (in case of sandwich the sum of all layers)",{"$nulls":6},"mm",{"$f":"Summary!U14","v":{"v":0,"d":"0.00"}}]
[]
["Results for non-stiffened plates"]
["Press reduction factor",{"$nulls":5},"Ψ",". / .",{"$f":"'main Side windows 6'!D23","v":false},"7.5"]
["              within limits 0,33 and 1,0",{"$nulls":7},{"$f":"'main Side windows 6'!D24","v":1},"7.5",{"$nulls":5},"Table 5 — Safety factor and minimum thickness of monolithic plates"]
["Basic design press",{"$nulls":5},"p","kPa",{"$f":"'main Side windows 6'!D25","v":1},"7.4",{"$nulls":5},"Material","Acronym","Safety factor\n γ ","Minimum thickness of monolithic plates, tm"]
["Allowable flexural stress",{"$nulls":5},"σa","MPa",{"$f":"'main Side windows 6'!D26","v":{"$error":"#N/A"}},"7.8",{"$nulls":8},"Design categories "]
["Curvature coefficient",{"$nulls":5},"kC",". / .",{"$f":"'main Side windows 6'!D27","v":{"$error":"#DIV/0!"}},"7.6",{"$nulls":8},"Any",null,"A & B","C & D"]
["Ratio a/b (valid ≤ 5)",{"$nulls":6},". / .",{"$f":"'main Side windows 6'!D28","v":{"$error":"#DIV/0!"}},"7.3, Annex G.2",{"$nulls":8},"Area Ia","Area II","Area III & IV","Area III & IV"]
["Ratio a/b corrected",{"$nulls":6},". / .",{"$f":"'main Side windows 6'!D29","v":{"$error":"#DIV/0!"}},"7.3, Annex G.2",{"$nulls":5},"Poly(methyl)methacrylate","PMMA",3.5,"6+0,1(LH-4)",6,5,4]
["Plate aspect ratio coeff stress",{"$nulls":5},"kr",". / .",{"$f":"'main Side windows 6'!D30","v":"FALSCH"},"7.3, Annex G.2",{"$nulls":5},"Polycarbonate","PC",3.5,"6+0,1(LH-4)",6,5,4]
["Pate aspect ratio coeff deflection",{"$nulls":5},"kf",". / .",{"$f":"'main Side windows 6'!D31","v":false},"7.3, Annex G.2",{"$nulls":5},"Monolithic tempered glass ","TG",4,"5+0,1(LH-4)b",4,4,3]
[{"$nulls":15},"Laminated glass ","LG",4,"5+0,1(LH-4)b",4,4,3]
["Thickness (Stress)",{"$nulls":5},"tr","mm",{"$f":"'main Side windows 6'!D33","v":{"$error":"#DIV/0!"}},"7.1.1",{"$nulls":5},"All mahogany plywood ","AMPW",2,"8+0,1(LH-4)",6,5,4]
["Thickness (Deflection)",{"$nulls":5},"tf","mm",{"$f":"'main Side windows 6'!D34","v":{"$error":"#DIV/0!"}},"7.1.2",{"$nulls":5},"GRP mat 30 % glass ","GRP M30",2,"4+0,1(LH-4)",3,3,2]
["Thickness",{"$nulls":6},"mm",{"$f":"'main Side windows 6'!D35","v":{"$error":"#DIV/0!"}},{"$nulls":6},"GRP mat/roving 35 % glass ","GRP M35",2,"4+0,1(LH-4)",3,3,2]
["Thickness minimu, techn. ",{"$nulls":5},"tm","mm",{"$f":"'main Side windows 6'!D36","v":{"$error":"#DIV/0!"}},"7.8",{"$nulls":5},"Aluminium alloy 5083-H111 ","AL 5038",2,"3+0,05 (LH-4)",3,3,2]
["Thickness minimum, Tab 5",{"$nulls":6},"mm",{"$f":"'main Side windows 6'!D37","v":{"v":0,"d":"0.0"}},"Table 5",{"$nulls":5},"Mild steel ","MS",2,"2,5+0,025 (LH-4)",2.5,2.5,2]
[]
["Required plate thickness",{"$nulls":6},"mm",{"$f":"'main Side windows 6'!I31","v":{"$error":"#DIV/0!"}}]
["Requirements fullfilled?",{"$nulls":7},{"$f":"IF(L13=\"short side in area I max 300mm\",\"FAIL\",IF(I25>=I44,\"PASS\",\"FAIL\"))","v":{"$error":"#DIV/0!"}}]

{"sheet":"main Side windows 6","index":20,"n_rows":43,"n_cols":24,"rows_kept":43,"hidden":true,"merged":[[0,0,0,5],[1,0,1,5],[25,11,28,18],[26,6,26,7]]}
[{"$nulls":6},"manufacturer"]
[{"$nulls":6},"model name"]
["Eingabe","Version 1.2.2 / 15-03-2006 rev 060512/070507/dew 090918",{"$nulls":4},"ISO/FDIS 12216:2002(E)"]
["Parameter Input","SSign","Item/Unit",{"$nulls":18},"Lists"]
["form of plate Rectangular/Circle",null,"R/C",{"$f":"'Worksheet 6'!AE9","v":""},{"$f":"IF(D5=\"\",\"Input R oder C\",\"\")","v":"Input R oder C"},null,"Material Properties see table F.1 and Tab. 5",{"$nulls":14},"R","I","A"]
["long side","a","mm",{"$f":"'Worksheet 6'!I9","v":0},{"$f":"IF(AND(D5=\"R\",D6=\"\"),\"Input a requested\",IF(AND(D5=\"C\",D6=\"\"),\"Input d requested\",\"\"))","v":""},null,"Table F.1 mechanical properties [Mpa]",null,null,"Tab. 5",{"$nulls":11},"C","IIa","B"]
["unsupported short side","b","mm",{"$f":"'Worksheet 6'!I10","v":0},{"$f":"IF(AND(D5=\"R\",D7=\"\"),\"Input b requested\",IF(AND(D5=\"C\",D7=\"\"),\"Input d requested\",\"\"))","v":""},null,"Material","strength","elasticity","safety",{"$nulls":12},"IIb","C"]
["diameter","d","mm",{"$f":"'Worksheet 6'!I11","v":0},{"$f":"IF(AND(D5=\"C\",D8=\"\"),\"Input d requested\",\"\")","v":""},null,"PMMA",110,3000,3.5,{"$nulls":3},"AG",40,72600,4,{"$nulls":5},"III","D"]
["curve height","c","mm",{"$f":"'Worksheet 6'!I12","v":0},"optional",null,"PC",90,2400,3.5,{"$nulls":3},"AISI 316 L",510,200000,2,{"$nulls":4},"SF","IV"]
["support SemiFixed/Simple Supp.",null,"SF/SS",{"$f":"'Worksheet 6'!AE13","v":"SS"},{"$f":"IF(D10=\"\",\"Input SF or SS\",\"\")","v":""},null,"TG",200,72600,4,null,null,"6.1","AL 5038",280,70000,2,{"$nulls":4},"SS"]
["Location type",null,"I/IIA/IIB/III/IV",{"$f":"'Worksheet 6'!I14","v":{"v":0,"d":"0.00"}},{"$f":"IF(D11=\"\",\"Input I / IIa,b / III / IV\",\"\")","v":""},null,"CG",300,72600,4,null,null,"3.17.1-4","AMPW",50,7000,2]
["Location area (only loc. III)",null,"F/S/A",{"$f":"'Worksheet 6'!AE16","v":""},{"$f":"IF(D12=\"F\",\"\",IF(D12=\"S\",\"\",IF(D12=\"A\",\"\",IF(D11=\"III\",\"Input F / S / A\",\"\"))))","v":""},null,"AG",40,72600,4,{"$nulls":3},"CG",300,72600,4,{"$nulls":4},"F","Any","yes"]
["Design Category",null,"A/B/C/D",{"$f":"IF('Worksheet 6'!I16=\"\",\"\",'Worksheet 6'!I16)","v":{"v":0,"d":"0.00"}},{"$f":"IF(D13=\"\",\"Input A / B / C / D\",\"\")","v":""},null,"AMPW",50,7000,2,{"$nulls":3},"GRP M30",140,7500,2,{"$nulls":4},"S","M","no"]
["Craft Type Any/Motor/Sail",null,"Any/M/S",{"$f":"'Worksheet 6'!AE18","v":""},{"$f":"IF(D14=\"\",\"Input Any / M / S\",\"\")","v":"Input Any / M / S"},null,"GRP M30",140,7500,2,{"$nulls":3},"GRP M35",175,10000,2,{"$nulls":4},"A","S"]
["optional: craft length of hull",null,"m",{"$f":"'Worksheet 6'!I18","v":{"v":0,"d":"0.00"}},"default, change if smaller",null,"GRP M35",175,10000,2,{"$nulls":3},"MS",400,200000,2]
[{"$nulls":6},"AL 5038",280,70000,2,{"$nulls":3},"PC",90,2400,3.5]
["Material",null,"see Tab. F.1",{"$f":"'Worksheet 6'!I19","v":{"v":0,"d":"0.00"}},{"$f":"IF(D17=\"\",\"manual input requ\",\"\")","v":""},null,"MS",400,200000,2,{"$nulls":3},"PMMA",110,3000,3.5]
["  ultimate flexural strength","Sigma u",null,{"$f":"LOOKUP(D17,N8:N18,O8:O18)","v":{"$error":"#N/A"}},"falls nicht in F.1 ",null,"AISI 316 L",510,200000,2,{"$nulls":3},"TG",200,72600,4]
["  modulus of elasticity","E",null,{"$f":"LOOKUP(D17,N8:N18,P8:P18)","v":{"$error":"#N/A"}},"Werte manuell"]
["  safety factor","gamma",null,{"$f":"LOOKUP(D17,N8:N18,Q8:Q18)","v":{"$error":"#N/A"}},"eintragen"]
[]
["Results for non-stiffened plates"]
["press reduction factor",null,null,{"$f":"IF(D5=\"R\",1.102-0.0004*D7,IF(D5=\"C\",1.102-0.0004*D8))","v":false},"(7.5)"]
["              within limits 0,33 and 1,0","psi",null,{"$f":"IF(D23<0.33,0.33,IF(D23>1,1,D23))","v":{"v":1,"d":"1.000"}},"(7.5)"]
["basic design press","p","KPa",{"$f":"'basic design pressure 6'!G43","v":{"v":1,"d":"1.00"}},"(7.4)",null,"see work sheet \"basic design press\""]
["allowable flexural stress","Sigma a","MPa",{"$f":"D18/D20","v":{"$error":"#N/A"}},"(7.8)",null,"is actual plate a sandwich?",null,{"$f":"'Worksheet 6'!I23","v":0},null,null,{"$f":"IF(I26=\"YES\",\"the difference in thickness between any two glass plies must be less than or equal to 2 mm and the thickness of the plastic interlayer must be less than, or equal to 0,76 mm for these conditions !\",\"\")","v":""}]
["curvature coefficient","kc",null,{"$f":"IF(D5=\"C\",1-(D9/D8),1-(D9/D7))","v":{"$error":"#DIV/0!"}},"(7.6)",null,{"$f":"IF(I26=\"yes\", \"number of layers?\",\"\")","v":""},null,{"$f":"IF('Worksheet 6'!I24=\"\",\"\",'Worksheet 6'!I24)","v":0}]
["              a/b real  (valid ≤ 5)",null,null,{"$f":"IF(D5=\"C\",1,D6/D7)","v":{"$error":"#DIV/0!"}},"(7.3) Annex G.2"]
["              a/b corrected",null,null,{"$f":"IF(D28>5,5,D28)","v":{"$error":"#DIV/0!"}},"(7.3) Annex G.2"]
["plate aspect ratio coeff stress","kr",null,{"$f":"IF(D5=\"R\",IF(D10=\"SF\",(0.62165*D29^2-0.6473*D29+0.26481)/(D29^2-1.173*D29+0.97671),IF(D10=\"SS\",(0.69952*D29^2+0.02662*D29-0.0735)/(D29^2-0.7185*D29+1.98925),\"Fehler\")),IF(D5=\"C\",IF(D10=\"SF\",0.248,0.309),\"FALSCH\"))","v":"FALSCH"},"(7.3) Annex G.2",null,"actual plate Thickness",null,{"$f":"'Worksheet 6'!I25","v":0},"mm",null,{"$f":"IF(I26=\"yes\", \"=sum of all plies\",\"\")","v":""}]
["pate aspect ratio coeff deflection","kf",null,{"$f":"IF(D5=\"R\",IF(D10=\"SF\",(0.08052*D29^2-0.0272*D29-0.0019)/(D29^2-0.9275*D29+1.70018),IF(D10=\"SS\",(0.12915*D29^2+0.00868*D29-0.0293)/(D29^2-0.887*D29+2.3372),\"Fehler\")),IF(D5=\"C\",IF(D10=\"SF\",0.027,0.043)))","v":false},"(7.3) Annex G.2",null,"required plate thickness",null,{"$f":"IF(AND(I26=\"Yes\",I27=\"\"),\"please enter number of layers\",IF(AND(I26=\"Yes\",I27>2),1.5*MAX(D35:D37),IF(AND(I26=\"Yes\",I27=2),1.2*MAX(D35:D37),IF(I36=\"Yes\",MAX(D36:D37),MAX(D35:D37)))))","v":{"$error":"#DIV/0!"}}]
[{"$nulls":6},"requirements fulfilled?",null,{"$f":"IF(I30=\"\",\"\",IF(I30>=I31,\"PASS\",\"FAIL\"))","v":{"$error":"#DIV/0!"}}]
["Thickness (Stress)","tr","mm",{"$f":"IF(D5=\"C\",D8*D27*SQRT(D30*D24*D25/D26/1000),D7*D27*SQRT(D30*D24*D25/D26/1000))","v":{"$error":"#DIV/0!"}},"(7.1.1)"]
["Thickness (Deflection)","tf","mm",{"$f":"0.45*(D33+D7*D27*POWER((D31*D24*D25/0.02/D19/1000),0.33333))","v":{"$error":"#DIV/0!"}},"(7.1.2)"]
["Thickness",null,null,{"$f":"ROUND(MAX(D33:D34),2)","v":{"$error":"#DIV/0!"}},"(7.1.7)",{"$nulls":3},"Minimum tech used???"]
["Thickness minimu, techn. ",null,"mm",{"$f":"D35-0.5","v":{"$error":"#DIV/0!"}},null,null," = Minimum, absolute",null,{"$f":"Summary!P14","v":0}]
["Thickness minimum, Tab 5","tm","mm",{"$f":"'basic design pressure 6'!J48","v":{"v":0,"d":"0.0"}},"(Tab. 5)",null,"(only PMMA, PC, TG, LG)"]
[]
["Escape Hatch possible ?"]
["Required ISO 9094-1, 2"]
["Circular: inner Diam > 450 mm",null,null,{"$f":"IF(D5=\"C\",IF(D8>450,\"pass\",\"fail\"),\"n.a.\")","v":"n.a."}]
["Rectang: inner Diam > 380 mm",null,null,{"$f":"IF(D5=\"R\",IF(MAX(D6:D7)>380,\"pass\",\"fail\"),\"n.a.\")","v":"n.a."}]
["              Area > 180000 mm²",null,null,{"$f":"IF(D5=\"R\",IF(D6*D7>180000,\"pass\",\"fail\"),\"n.a.\")","v":"n.a."}]

{"sheet":"basic design pressure 6","index":21,"n_rows":193,"n_cols":10,"rows_kept":193,"hidden":true}
["Basic design pressure",null,null,"(7.4 Table 4)"]
[]
["location",null,{"$f":"'main Side windows 6'!D11","v":0}]
["particular",null,{"$f":"IF(AND(C5=\"C\",C6=\"M\",C3=\"III\"),\"A\",'main Side windows 6'!D12)","v":""},null,"Remark: f=front, s=side"]
["design cat",null,{"$f":"'main Side windows 6'!D13","v":0}]
["craft type",null,{"$f":"'main Side windows 6'!D14","v":""},{"$f":"IF(C6=\"Any\",\"S\",C6)","v":""},"Remark: if craft type = Any, set craft type = S"]
[]
[]
["Tabelle 4",null,"location","craft type","design cat","particular","pressure"]
[null,null,"I","Any","Any","Any",70]
[null,null,"IIB","Any","A","Any",70]
[null,null,"IIB","Any","B","Any",50]
[null,null,"IIB","Any","C","Any",28]
[null,null,"IIB","Any","D","Any",28]
[null,null,"IIA","Any","Any","Any",28]
[null,null,"III","S","A","Any",18]
[null,null,"III","S","B","Any",18]
[null,null,"III","S","C","Any",12]
[null,null,"III","S","D","Any",12]
[null,null,"III","M","A","Front",12]
[null,null,"III","M","A","Any",12]
[null,null,"III","M","B","Front",9]
[null,null,"III","M","B","Any",9]
[null,null,"III","M","D","Front",6,null,null,"Korrektur, Zeile eingefügt um Fehler bei eingabe III, M, Front, D zu beheben"]
[null,null,"III","M","A","Side",9]
[null,null,"III","M","B","Side",6]
[null,null,"III","M","C","Any",6]
[null,null,"III","M","D","Any",6]
[null,null,"IV","S","Any","Any",12]
[null,null,"IV","M","Any","Any",6]
[]
["Ergebnis"]
[null,"location = I",{"$nulls":4},{"$f":"IF(C3=\"I\",G10,0)","v":0}]
[null,"location = IIB",{"$nulls":4},{"$f":"IF(C3=\"IIB\",VLOOKUP(C5,E11:G15,3),0)","v":0}]
[null,"location = IIA",{"$nulls":4},{"$f":"IF(C3=\"IIA\",VLOOKUP(C3,E11:G15,3),0)","v":0}]
[null,"location = III","craft = S",{"$nulls":3},{"$f":"IF(AND(C3=\"III\",D6=\"S\"),VLOOKUP(C5,E16:G19,3),0)","v":0}]
[null,"location = III","craft = M","particular = front",null,null,{"$f":"IF(AND(C3=\"III\",D6=\"M\",C4=\"F\"),VLOOKUP(C5,E20:G24,3),0)","v":0}]
[null,"location = III","craft = M","particular = any",null,null,{"$f":"IF(AND(OR(C5=\"A\",C5=\"B\"),C3=\"III\",D6=\"M\",C4=\"A\"),VLOOKUP(C5,E20:G24,3),0)","v":0}]
[null,"location = III","craft = M","particular = side",null,null,{"$f":"IF(AND(C3=\"III\",C6=\"M\",C4=\"S\"),IF(C5=\"A\",9,IF(C5=\"B\",6,0)))","v":false}]
[null,"location = III","craft = M",{"$nulls":3},{"$f":"IF(C5=\"A\",0,IF(C5=\"B\",0,IF(AND(C3=\"III\",C6=\"M\"),VLOOKUP(C5,E27:G28,3))))","v":false}]
[null,"location = IV",{"$nulls":4},{"$f":"IF(C3=\"IV\",VLOOKUP(D6,D29:G30,4,0),1)","v":1}]
[]
["pressure",{"$nulls":5},{"$f":"MAX(G33:G41)","v":1}]
[]
[]
["minimum thickness"]
[]
[null,"Area",{"$f":"IF(OR('main Side windows 6'!D11=\"IIA\",'main Side windows 6'!D11=\"IIB\"),\"II\",'main Side windows 6'!D11)","v":0},{"$nulls":4},"minimum thickness",null,{"$f":"MAX(J50:J190)","v":0}]
[]
[null,null,"PMMA","A","I",{"$f":" IF('main Side windows 6'!$D$15>0,6 + 0.1*('main Side windows 6'!$D$15-4),\"\")","v":""},{"$nulls":3},{"$f":"IF('main Side windows 6'!$D$17=\"PMMA\",(IF('main Side windows 6'!$D$13=\"A\",VLOOKUP($C$48,$E$50:$F$53,2,-1),0)),0)","v":0}]
["Table 5",{"$nulls":3},"II",6]
[{"$nulls":4},"III",5]
[{"$nulls":4},"IV",5]
[null,null,"PMMA","B","I",{"$f":" IF('main Side windows 6'!$D$15>0,6 + 0.1*('main Side windows 6'!$D$15-4),\"\")","v":""},{"$nulls":3},{"$f":"IF('main Side windows 6'!$D$17=\"PMMA\",(IF('main Side windows 6'!$D$13=\"B\",VLOOKUP($C$48,$E$54:$F$57,2,-1),0)),0)","v":0}]
[{"$nulls":4},"II",6]
[{"$nulls":4},"III",5]
[{"$nulls":4},"IV",5]
[null,null,"PMMA","C","I",{"$f":" IF('main Side windows 6'!$D$15>0,6 + 0.1*('main Side windows 6'!$D$15-4),\"\")","v":""},{"$nulls":3},{"$f":"IF('main Side windows 6'!$D$17=\"PMMA\",(IF('main Side windows 6'!$D$13=\"C\",VLOOKUP($C$48,$E$58:$F$61,2,-1),0)),0)","v":0}]
[{"$nulls":4},"II",6]
[{"$nulls":4},"III",4]
[{"$nulls":4},"IV",4]
[null,null,"PMMA","D","I",{"$f":" IF('main Side windows 6'!$D$15>0,6 + 0.1*('main Side windows 6'!$D$15-4),\"\")","v":""},{"$nulls":3},{"$f":"IF('main Side windows 6'!$D$17=\"PMMA\",(IF('main Side windows 6'!$D$13=\"D\",VLOOKUP($C$48,E62:F65,2,-1),0)),0)","v":0}]
[{"$nulls":4},"II",6]
[{"$nulls":4},"III",4]
[{"$nulls":4},"IV",4]
[null,null,"PC","A","I",{"$f":" IF('main Side windows 6'!$D$15>0,6 + 0.1*('main Side windows 6'!$D$15-4),\"\")","v":""},{"$nulls":3},{"$f":"IF('main Side windows 6'!$D$17=\"PC\",(IF('main Side windows 6'!$D$13=\"A\",VLOOKUP($C$48,E66:F69,2,-1),0)),0)","v":0}]
[{"$nulls":4},"II",6]
[{"$nulls":4},"III",5]
[{"$nulls":4},"IV",5]
[null,null,"PC","B","I",{"$f":" IF('main Side windows 6'!$D$15>0,6 + 0.1*('main Side windows 6'!$D$15-4),\"\")","v":""},{"$nulls":3},{"$f":"IF('main Side windows 6'!$D$17=\"PC\",(IF('main Side windows 6'!$D$13=\"B\",VLOOKUP($C$48,E70:F73,2,-1),0)),0)","v":0}]
[{"$nulls":4},"II",6]
[{"$nulls":4},"III",5]
[{"$nulls":4},"IV",5]
[null,null,"PC","C","I",{"$f":" IF('main Side windows 6'!$D$15>0,6 + 0.1*('main Side windows 6'!$D$15-4),\"\")","v":""},{"$nulls":3},{"$f":"IF('main Side windows 6'!$D$17=\"PC\",(IF('main Side windows 6'!$D$13=\"C\",VLOOKUP($C$48,E74:F77,2,-1),0)),0)","v":0}]
[{"$nulls":4},"II",6]
[{"$nulls":4},"III",4]
[{"$nulls":4},"IV",4]
[null,null,"PC","D","I",{"$f":" IF('main Side windows 6'!$D$15>0,6 + 0.1*('main Side windows 6'!$D$15-4),\"\")","v":""},{"$nulls":3},{"$f":"IF('main Side windows 6'!$D$17=\"PC\",(IF('main Side windows 6'!$D$13=\"D\",VLOOKUP($C$48,E78:F81,2,-1),0)),0)","v":0}]
[{"$nulls":4},"II",6]
[{"$nulls":4},"III",4]
[{"$nulls":4},"IV",4]
[null,null,"TG","A","I",{"$f":" IF('main Side windows 6'!$D$15>0,5+ 0.1*('main Side windows 6'!$D$15-4),\"\")","v":""},{"$nulls":3},{"$f":"IF('main Side windows 6'!$D$17=\"TG\",(IF('main Side windows 6'!$D$13=\"A\",VLOOKUP($C$48,E82:F85,2,-1),0)),0)","v":0}]
[{"$nulls":4},"II",4]
[{"$nulls":4},"III",4]
[{"$nulls":4},"IV",4]
[null,null,"TG","B","I",{"$f":" IF('main Side windows 6'!$D$15>0,5+ 0.1*('main Side windows 6'!$D$15-4),\"\")","v":""},{"$nulls":3},{"$f":"IF('main Side windows 6'!$D$17=\"TG\",(IF('main Side windows 6'!$D$13=\"B\",VLOOKUP($C$48,E86:F89,2,-1),0)),0)","v":0}]
[{"$nulls":4},"II",4]
[{"$nulls":4},"III",4]
[{"$nulls":4},"IV",4]
[null,null,"TG","C","I",{"$f":" IF('main Side windows 6'!$D$15>0,5+ 0.1*('main Side windows 6'!$D$15-4),\"\")","v":""},{"$nulls":3},{"$f":"IF('main Side windows 6'!$D$17=\"TG\",(IF('main Side windows 6'!$D$13=\"C\",VLOOKUP($C$48,E90:F93,2,-1),0)),0)","v":0}]
[{"$nulls":4},"II",4]
[{"$nulls":4},"III",3]
[{"$nulls":4},"IV",3]
[null,null,"TG","D","I",{"$f":" IF('main Side windows 6'!$D$15>0,5+ 0.1*('main Side windows 6'!$D$15-4),\"\")","v":""},{"$nulls":3},{"$f":"IF('main Side windows 6'!$D$17=\"TG\",(IF('main Side windows 6'!$D$13=\"D\",VLOOKUP($C$48,E94:F97,2,-1),0)),0)","v":0}]
[{"$nulls":4},"II",4]
[{"$nulls":4},"III",3]
[{"$nulls":4},"IV",3]
[null,null,"LG","A","I",{"$f":" IF('main Side windows 6'!$D$15>0,5+ 0.1*('main Side windows 6'!$D$15-4),\"\")","v":""},{"$nulls":3},{"$f":"IF('main Side windows 6'!$D$17=\"LG\",(IF('main Side windows 6'!$D$13=\"A\",VLOOKUP($C$48,E98:F101,2,-1),0)),0)","v":0}]
[{"$nulls":4},"II",4]
[{"$nulls":4},"III",4]
[{"$nulls":4},"IV",4]
[null,null,"LG","B","I",{"$f":" IF('main Side windows 6'!$D$15>0,5+ 0.1*('main Side windows 6'!$D$15-4),\"\")","v":""},{"$nulls":3},{"$f":"IF('main Side windows 6'!$D$17=\"LG\",(IF('main Side windows 6'!$D$13=\"B\",VLOOKUP($C$48,E102:F105,2,-1),0)),0)","v":0}]
[{"$nulls":4},"II",4]
[{"$nulls":4},"III",4]
[{"$nulls":4},"IV",4]
[null,null,"LG","C","I",{"$f":" IF('main Side windows 6'!$D$15>0,5+ 0.1*('main Side windows 6'!$D$15-4),\"\")","v":""},{"$nulls":3},{"$f":"IF('main Side windows 6'!$D$17=\"LG\",(IF('main Side windows 6'!$D$13=\"C\",VLOOKUP($C$48,E106:F109,2,-1),0)),0)","v":0}]
[{"$nulls":4},"II",4]
[{"$nulls":4},"III",3]
[{"$nulls":4},"IV",3]
[null,null,"LG","D","I",{"$f":" IF('main Side windows 6'!$D$15>0,5+ 0.1*('main Side windows 6'!$D$15-4),\"\")","v":""},{"$nulls":3},{"$f":"IF('main Side windows 6'!$D$17=\"LG\",(IF('main Side windows 6'!$D$13=\"D\",VLOOKUP($C$48,E110:F113,2,-1),0)),0)","v":0}]
[{"$nulls":4},"II",4]
[{"$nulls":4},"III",3]
[{"$nulls":4},"IV",3]
[null,null,"AMPW","A","I",{"$f":" IF('main Side windows 6'!$D$15>0,8+ 0.1*('main Side windows 6'!$D$15-4),\"\")","v":""},{"$nulls":3},{"$f":"IF('main Side windows 6'!$D$17=\"AMPW\",(IF('main Side windows 6'!$D$13=\"A\",VLOOKUP($C$48,E114:F117,2,-1),0)),0)","v":0}]
[{"$nulls":4},"II",6]
[{"$nulls":4},"III",5]
[{"$nulls":4},"IV",5]
[null,null,"AMPW","B","I",{"$f":" IF('main Side windows 6'!$D$15>0,8+ 0.1*('main Side windows 6'!$D$15-4),\"\")","v":""},{"$nulls":3},{"$f":"IF('main Side windows 6'!$D$17=\"AMPW\",(IF('main Side windows 6'!$D$13=\"B\",VLOOKUP($C$48,E118:F121,2,-1),0)),0)","v":0}]
[{"$nulls":4},"II",6]
[{"$nulls":4},"III",5]
[{"$nulls":4},"IV",5]
[null,null,"AMPW","C","I",{"$f":" IF('main Side windows 6'!$D$15>0,8+ 0.1*('main Side windows 6'!$D$15-4),\"\")","v":""},{"$nulls":3},{"$f":"IF('main Side windows 6'!$D$17=\"AMPW\",(IF('main Side windows 6'!$D$13=\"C\",VLOOKUP($C$48,E122:F125,2,-1),0)),0)","v":0}]
[{"$nulls":4},"II",6]
[{"$nulls":4},"III",4]
[{"$nulls":4},"IV",4]
[null,null,"AMPW","D","I",{"$f":" IF('main Side windows 6'!$D$15>0,8+ 0.1*('main Side windows 6'!$D$15-4),\"\")","v":""},{"$nulls":3},{"$f":"IF('main Side windows 6'!$D$17=\"AMPW\",(IF('main Side windows 6'!$D$13=\"D\",VLOOKUP($C$48,E126:F129,2,-1),0)),0)","v":0}]
[{"$nulls":4},"II",6]
[{"$nulls":4},"III",4]
[{"$nulls":4},"IV",4]
[null,null,"GRP m30","A","I",{"$f":" IF('main Side windows 6'!$D$15>0,4 + 0.1*('main Side windows 6'!$D$15-4),\"\")","v":""},{"$nulls":3},{"$f":"IF('main Side windows 6'!$D$17=\"GRP M30\",(IF('main Side windows 6'!$D$13=\"A\",VLOOKUP($C$48,E130:F133,2,-1),0)),0)","v":0}]
[{"$nulls":4},"II",3]
[{"$nulls":4},"III",3]
[{"$nulls":4},"IV",3]
[null,null,"GRP m30","B","I",{"$f":" IF('main Side windows 6'!$D$15>0,4 + 0.1*('main Side windows 6'!$D$15-4),\"\")","v":""},{"$nulls":3},{"$f":"IF('main Side windows 6'!$D$17=\"GRP M30\",(IF('main Side windows 6'!$D$13=\"B\",VLOOKUP($C$48,E134:F137,2,-1),0)),0)","v":0}]
[{"$nulls":4},"II",3]
[{"$nulls":4},"III",3]
[{"$nulls":4},"IV",3]
[null,null,"GRP m30","C","I",{"$f":" IF('main Side windows 6'!$D$15>0,4 + 0.1*('main Side windows 6'!$D$15-4),\"\")","v":""},{"$nulls":3},{"$f":"IF('main Side windows 6'!$D$17=\"GRP M30\",(IF('main Side windows 6'!$D$13=\"C\",VLOOKUP($C$48,E138:F141,2,-1),0)),0)","v":0}]
[{"$nulls":4},"II",3]
[{"$nulls":4},"III",2]
[{"$nulls":4},"IV",2]
[null,null,"GRP m30","D","I",{"$f":" IF('main Side windows 6'!$D$15>0,4 + 0.1*('main Side windows 6'!$D$15-4),\"\")","v":""},{"$nulls":3},{"$f":"IF('main Side windows 6'!$D$17=\"GRP M30\",(IF('main Side windows 6'!$D$13=\"D\",VLOOKUP($C$48,E142:F145,2,-1),0)),0)","v":0}]
[{"$nulls":4},"II",3]
[{"$nulls":4},"III",2]
[{"$nulls":4},"IV",2]
[null,null,"GRP m35","A","I",{"$f":" IF('main Side windows 6'!$D$15>0,4 + 0.1*('main Side windows 6'!$D$15-4),\"\")","v":""},{"$nulls":3},{"$f":"IF('main Side windows 6'!$D$17=\"GRP M35\",(IF('main Side windows 6'!$D$13=\"A\",VLOOKUP($C$48,E146:F149,2,-1),0)),0)","v":0}]
[{"$nulls":4},"II",3]
[{"$nulls":4},"III",3]
[{"$nulls":4},"IV",3]
[null,null,"GRP m35","B","I",{"$f":" IF('main Side windows 6'!$D$15>0,4 + 0.1*('main Side windows 6'!$D$15-4),\"\")","v":""},{"$nulls":3},{"$f":"IF('main Side windows 6'!$D$17=\"GRP M35\",(IF('main Side windows 6'!$D$13=\"B\",VLOOKUP($C$48,E150:F153,2,-1),0)),0)","v":0}]
[{"$nulls":4},"II",3]
[{"$nulls":4},"III",3]
[{"$nulls":4},"IV",3]
[null,null,"GRP m35","C","I",{"$f":" IF('main Side windows 6'!$D$15>0,4 + 0.1*('main Side windows 6'!$D$15-4),\"\")","v":""},{"$nulls":3},{"$f":"IF('main Side windows 6'!$D$17=\"GRP M35\",(IF('main Side windows 6'!$D$13=\"C\",VLOOKUP($C$48,E154:F157,2,-1),0)),0)","v":0}]
[{"$nulls":4},"II",3]
[{"$nulls":4},"III",2]
[{"$nulls":4},"IV",2]
[null,null,"GRP m35","D","I",{"$f":" IF('main Side windows 6'!$D$15>0,4 + 0.1*('main Side windows 6'!$D$15-4),\"\")","v":""},{"$nulls":3},{"$f":"IF('main Side windows 6'!$D$17=\"GRP M35\",(IF('main Side windows 6'!$D$13=\"D\",VLOOKUP($C$48,E158:F161,2,-1),0)),0)","v":0}]
[{"$nulls":4},"II",3]
[{"$nulls":4},"III",2]
[{"$nulls":4},"IV",2]
[null,null,"Al 5038","A","I",{"$f":" IF('main Side windows 6'!$D$15>0,3 + 0.05*('main Side windows 6'!$D$15-4),\"\")","v":""},{"$nulls":3},{"$f":"IF('main Side windows 6'!$D$17=\"Al 5038\",(IF('main Side windows 6'!$D$13=\"A\",VLOOKUP($C$48,E162:F165,2,-1),0)),0)","v":0}]
[{"$nulls":4},"II",3]
[{"$nulls":4},"III",3]
[{"$nulls":4},"IV",3]
[null,null,"Al 5038","B","I",{"$f":" IF('main Side windows 6'!$D$15>0,3 + 0.05*('main Side windows 6'!$D$15-4),\"\")","v":""},{"$nulls":3},{"$f":"IF('main Side windows 6'!$D$17=\"AL 5038\",(IF('main Side windows 6'!$D$13=\"B\",VLOOKUP($C$48,E166:F169,2,-1),0)),0)","v":0}]
[{"$nulls":4},"II",3]
[{"$nulls":4},"III",3]
[{"$nulls":4},"IV",3]
[null,null,"Al 5038","C","I",{"$f":" IF('main Side windows 6'!$D$15>0,3 + 0.05*('main Side windows 6'!$D$15-4),\"\")","v":""},{"$nulls":3},{"$f":"IF('main Side windows 6'!$D$17=\"AL 5038\",(IF('main Side windows 6'!$D$13=\"C\",VLOOKUP($C$48,E170:F173,2,-1),0)),0)","v":0}]
[{"$nulls":4},"II",3]
[{"$nulls":4},"III",2]
[{"$nulls":4},"IV",2]
[null,null,"Al 5038","D","I",{"$f":" IF('main Side windows 6'!$D$15>0,3 + 0.05*('main Side windows 6'!$D$15-4),\"\")","v":""},{"$nulls":3},{"$f":"IF('main Side windows 6'!$D$17=\"AL 5038\",(IF('main Side windows 6'!$D$13=\"D\",VLOOKUP($C$48,E174:F177,2,-1),0)),0)","v":0}]
[{"$nulls":4},"II",3]
[{"$nulls":4},"III",2]
[{"$nulls":4},"IV",2]
[null,null,"MS","A","I",{"$f":" IF('main Side windows 6'!$D$15>0,2.5 + 0.025*('main Side windows 6'!$D$15-4),\"\")","v":""},{"$nulls":3},{"$f":"IF('main Side windows 6'!$D$17=\"MS\",(IF('main Side windows 6'!$D$13=\"A\",VLOOKUP($C$48,E178:F181,2,-1),0)),0)","v":0}]
[{"$nulls":4},"II",2.5]
[{"$nulls":4},"III",2.5]
[{"$nulls":4},"IV",2.5]
[null,null,"MS","B","I",{"$f":" IF('main Side windows 6'!$D$15>0,2.5 + 0.025*('main Side windows 6'!$D$15-4),\"\")","v":""},{"$nulls":3},{"$f":"IF('main Side windows 6'!$D$17=\"MS\",(IF('main Side windows 6'!$D$13=\"B\",VLOOKUP($C$48,E182:F185,2,-1),0)),0)","v":0}]
[{"$nulls":4},"II",2.5]
[{"$nulls":4},"III",2.5]
[{"$nulls":4},"IV",2.5]
[null,null,"MS","C","I",{"$f":" IF('main Side windows 6'!$D$15>0,2.5 + 0.025*('main Side windows 6'!$D$15-4),\"\")","v":""},{"$nulls":3},{"$f":"IF('main Side windows 6'!$D$17=\"MS\",(IF('main Side windows 6'!$D$13=\"C\",VLOOKUP($C$48,E186:F189,2,-1),0)),0)","v":0}]
[{"$nulls":4},"II",2.5]
[{"$nulls":4},"III",2]
[{"$nulls":4},"IV",2]
[null,null,"MS","D","I",{"$f":" IF('main Side windows 6'!$D$15>0,2.5 + 0.025*('main Side windows 6'!$D$15-4),\"\")","v":""},{"$nulls":3},{"$f":"IF('main Side windows 6'!$D$17=\"MS\",(IF('main Side windows 6'!$D$13=\"D\",VLOOKUP($C$48,E190:F193,2,-1),0)),0)","v":0}]
[{"$nulls":4},"II",2.5]
[{"$nulls":4},"III",2]
[{"$nulls":4},"IV",2]

{"sheet":"Worksheet 7","index":22,"n_rows":45,"n_cols":31,"rows_kept":45,"merged":[[0,0,0,9],[0,11,0,12],[1,0,1,9],[2,0,2,9],[4,0,4,9],[6,0,6,5],[17,13,17,14],[19,13,19,14],[21,12,21,14],[22,15,26,18],[27,6,28,6],[27,7,28,7],[27,15,27,21],[29,15,32,15],[29,16,32,16],[29,17,32,17],[29,18,29,21],[30,18,30,21],[31,18,31,19],[32,11,32,13],[34,13,34,14],[36,13,36,14],[38,13,38,14],[39,13,39,14],[41,13,41,14]]}
[{"$nulls":11},"Comments"]
["ISO 12216:2020 - Small craft - Windows, portlights, hatches, deadlights and doors",{"$nulls":11},"Derived values"]
["WORKSHEET No. 1 data entry",{"$nulls":11},"Input values"]
[]
[{"$f":"CONCATENATE(coverSheet!B5,\"   \",coverSheet!B12,\"   \",Summary!B15)","v":"      "}]
[]
["Parameter",{"$nulls":5},"Symbol","Unit","Value","Ref.",{"$nulls":5},"Material Properties see table F.1 and Tab. 5",{"$nulls":11},"List"]
["Form of plate (Rectangular / Circle)",{"$nulls":5},"R / C",null,{"$f":"Summary!C15","v":0},"Annex C",{"$nulls":5},"Table F.1 mechanical properties [MPa]",null,null,"Tab. 5",{"$nulls":8},"Lists"]
["Long side",{"$nulls":5},"a","mm",{"$f":"Summary!D15","v":0},"7.3, Annex C",{"$nulls":5},"Material","strength","elasticity","safety",{"$nulls":7},"rectangular","R","I","A",{"$f":"IF(I8=\"rectangular\",\"R\",IF(I8=\"circle\",\"C\",\"\"))","v":""}]
["Unsupported short side",{"$nulls":5},"b","mm",{"$f":"Summary!E15","v":0},"7.3, Annex C",{"$nulls":5},"PMMA",110,3000,3.5,{"$nulls":7},"circle","C","IIa","B"]
["Diameter",{"$nulls":5},"d","mm",{"$f":"Summary!F15","v":0},"7.3, Annex C",{"$nulls":5},"PC",90,2400,3.5,{"$nulls":9},"IIb","C"]
["Curve height",{"$nulls":5},"c","mm",{"$f":"Summary!G15","v":0},"7.6",{"$nulls":5},"TG",200,72600,4,{"$nulls":9},"III","D"]
["Support SemiFixed / Simply Supported",{"$nulls":5},"SF / SS",null,{"$f":"Summary!H15","v":0},"3.18",{"$nulls":5},"CG",300,72600,4,{"$nulls":7},"semi-fixed","SF","IV",null,{"$f":"IF(I13=\"semi-fixed\",\"SF\",IF(I13=\"\",\"\",\"SS\"))","v":"SS"}]
["Location type",{"$nulls":5},"I/IIA/IIB/III/IV",null,{"$f":"Summary!I15","v":0},"3.17; Annex A",{"$nulls":5},"AG",40,72600,4,{"$nulls":7},"simply supported","SS"]
["Location area (only loc. III)",{"$nulls":5},"F / S / Any",null,{"$f":"Summary!J15","v":0},"3.17.4",{"$nulls":5},"AMPW",50,7000,2]
["Design Category",{"$nulls":5},"A / B / C / D",null,{"$f":"Summary!K15","v":0},"3.12",{"$nulls":5},"GRP M30",140,7500,2,{"$nulls":6},"any","front","F","Any","yes",{"$f":"IF(I15=\"front\",\"F\",IF(I15=\"side\",\"S\",IF(I15=\"any\",\"A\",\"\")))","v":""}]
["Craft Type Any/Motor/Sail",{"$nulls":5},"Any / M / S",null,{"$f":"Summary!L15","v":0},{"$nulls":6},"GRP M35",175,10000,2,{"$nulls":6},"motor","side","S","M","no"]
["Length of hull as in ISO 8666",{"$nulls":5},"LH","m",{"$f":"Summary!N15","v":{"v":0,"d":"0.00"}},"3.16",{"$nulls":5},"AL 5038",280,70000,2,{"$nulls":6},"sail","any","Any","S",null,{"$f":"IF(I17=\"any\",\"Any\",IF(I17=\"motor\",\"M\",IF(I17=\"sail\",\"S\",\"\")))","v":""}]
["Material data",{"$nulls":7},{"$f":"Summary!O15","v":0},"Table F.1 & 5",{"$nulls":5},"MS",400,200000,2]
[null,"  Ultimate flexural strength",{"$nulls":4},"σU","MPa",{"$f":"'main Side windows 7'!D18","v":{"$error":"#N/A"}},"Table F.1 & 5",{"$nulls":5},"AISI 316 L",510,200000,2]
[null,"  Modulus of elasticity",{"$nulls":4},"E","MPa",{"$f":"'main Side windows 7'!D19","v":{"$error":"#N/A"}},"Table F.1 & 5"]
[null,"  Safety factor",{"$nulls":4},"gamma",". / .",{"$f":"'main Side windows 7'!D20","v":{"$error":"#N/A"}},"Table F.1 & 5",{"$nulls":15},"yes"]
["Is actual plate a sandwich?",{"$nulls":5},"yes / no",null,{"$f":"Summary!Q15","v":0},"7.9",{"$nulls":5},{"$f":"IF(I23=\"YES\",\"The difference in thickness between any two glass plies must be less than or equal to 2 mm and the thickness of the plastic interlayer must be less than, or equal to 0,76 mm for these conditions !\",\"\")","v":""},{"$nulls":9},"no"]
[null,"If yes, enter number of layers",{"$nulls":5},". / .",{"$f":"Summary!R15","v":0},"7.9"]
["Actual plate thickness (in case of sandwich the sum of all layers)",{"$nulls":6},"mm",{"$f":"Summary!U15","v":{"v":0,"d":"0.00"}}]
[]
["Results for non-stiffened plates"]
["Press reduction factor",{"$nulls":5},"Ψ",". / .",{"$f":"'main Side windows 7'!D23","v":false},"7.5"]
["              within limits 0,33 and 1,0",{"$nulls":7},{"$f":"'main Side windows 7'!D24","v":1},"7.5",{"$nulls":5},"Table 5 — Safety factor and minimum thickness of monolithic plates"]
["Basic design press",{"$nulls":5},"p","kPa",{"$f":"'main Side windows 7'!D25","v":1},"7.4",{"$nulls":5},"Material","Acronym","Safety factor\n γ ","Minimum thickness of monolithic plates, tm"]
["Allowable flexural stress",{"$nulls":5},"σa","MPa",{"$f":"'main Side windows 7'!D26","v":{"$error":"#N/A"}},"7.8",{"$nulls":8},"Design categories "]
["Curvature coefficient",{"$nulls":5},"kC",". / .",{"$f":"'main Side windows 7'!D27","v":{"$error":"#DIV/0!"}},"7.6",{"$nulls":8},"Any",null,"A & B","C & D"]
["Ratio a/b (valid ≤ 5)",{"$nulls":6},". / .",{"$f":"'main Side windows 7'!D28","v":{"$error":"#DIV/0!"}},"7.3, Annex G.2",{"$nulls":8},"Area Ia","Area II","Area III & IV","Area III & IV"]
["Ratio a/b corrected",{"$nulls":6},". / .",{"$f":"'main Side windows 7'!D29","v":{"$error":"#DIV/0!"}},"7.3, Annex G.2",{"$nulls":5},"Poly(methyl)methacrylate","PMMA",3.5,"6+0,1(LH-4)",6,5,4]
["Plate aspect ratio coeff stress",{"$nulls":5},"kr",". / .",{"$f":"'main Side windows 7'!D30","v":"FALSCH"},"7.3, Annex G.2",{"$nulls":5},"Polycarbonate","PC",3.5,"6+0,1(LH-4)",6,5,4]
["Pate aspect ratio coeff deflection",{"$nulls":5},"kf",". / .",{"$f":"'main Side windows 7'!D31","v":false},"7.3, Annex G.2",{"$nulls":5},"Monolithic tempered glass ","TG",4,"5+0,1(LH-4)b",4,4,3]
[{"$nulls":15},"Laminated glass ","LG",4,"5+0,1(LH-4)b",4,4,3]
["Thickness (Stress)",{"$nulls":5},"tr","mm",{"$f":"'main Side windows 7'!D33","v":{"$error":"#DIV/0!"}},"7.1.1",{"$nulls":5},"All mahogany plywood ","AMPW",2,"8+0,1(LH-4)",6,5,4]
["Thickness (Deflection)",{"$nulls":5},"tf","mm",{"$f":"'main Side windows 7'!D34","v":{"$error":"#DIV/0!"}},"7.1.2",{"$nulls":5},"GRP mat 30 % glass ","GRP M30",2,"4+0,1(LH-4)",3,3,2]
["Thickness",{"$nulls":6},"mm",{"$f":"'main Side windows 7'!D35","v":{"$error":"#DIV/0!"}},{"$nulls":6},"GRP mat/roving 35 % glass ","GRP M35",2,"4+0,1(LH-4)",3,3,2]
["Thickness minimu, techn. ",{"$nulls":5},"tm","mm",{"$f":"'main Side windows 7'!D36","v":{"$error":"#DIV/0!"}},"7.8",{"$nulls":5},"Aluminium alloy 5083-H111 ","AL 5038",2,"3+0,05 (LH-4)",3,3,2]
["Thickness minimum, Tab 5",{"$nulls":6},"mm",{"$f":"'main Side windows 7'!D37","v":{"v":0,"d":"0.0"}},"Table 5",{"$nulls":5},"Mild steel ","MS",2,"2,5+0,025 (LH-4)",2.5,2.5,2]
[]
["Required plate thickness",{"$nulls":6},"mm",{"$f":"'main Side windows 7'!I31","v":{"$error":"#DIV/0!"}}]
["Requirements fullfilled?",{"$nulls":7},{"$f":"IF(L13=\"short side in area I max 300mm\",\"FAIL\",IF(I25>=I44,\"PASS\",\"FAIL\"))","v":{"$error":"#DIV/0!"}}]

{"sheet":"main Side windows 7","index":23,"n_rows":43,"n_cols":24,"rows_kept":43,"hidden":true,"merged":[[0,0,0,5],[1,0,1,5],[25,11,28,18],[26,6,26,7]]}
[{"$nulls":6},"manufacturer"]
[{"$nulls":6},"model name"]
["Eingabe","Version 1.2.2 / 15-03-2006 rev 060512/070507/dew 090918",{"$nulls":4},"ISO/FDIS 12216:2002(E)"]
["Parameter Input","SSign","Item/Unit",{"$nulls":18},"Lists"]
["form of plate Rectangular/Circle",null,"R/C",{"$f":"'Worksheet 7'!AE9","v":""},{"$f":"IF(D5=\"\",\"Input R oder C\",\"\")","v":"Input R oder C"},null,"Material Properties see table F.1 and Tab. 5",{"$nulls":14},"R","I","A"]
["long side","a","mm",{"$f":"'Worksheet 7'!I9","v":0},{"$f":"IF(AND(D5=\"R\",D6=\"\"),\"Input a requested\",IF(AND(D5=\"C\",D6=\"\"),\"Input d requested\",\"\"))","v":""},null,"Table F.1 mechanical properties [Mpa]",null,null,"Tab. 5",{"$nulls":11},"C","IIa","B"]
["unsupported short side","b","mm",{"$f":"'Worksheet 7'!I10","v":0},{"$f":"IF(AND(D5=\"R\",D7=\"\"),\"Input b requested\",IF(AND(D5=\"C\",D7=\"\"),\"Input d requested\",\"\"))","v":""},null,"Material","strength","elasticity","safety",{"$nulls":12},"IIb","C"]
["diameter","d","mm",{"$f":"'Worksheet 7'!I11","v":0},{"$f":"IF(AND(D5=\"C\",D8=\"\"),\"Input d requested\",\"\")","v":""},null,"PMMA",110,3000,3.5,{"$nulls":3},"AG",40,72600,4,{"$nulls":5},"III","D"]
["curve height","c","mm",{"$f":"'Worksheet 7'!I12","v":0},"optional",null,"PC",90,2400,3.5,{"$nulls":3},"AISI 316 L",510,200000,2,{"$nulls":4},"SF","IV"]
["support SemiFixed/Simple Supp.",null,"SF/SS",{"$f":"'Worksheet 7'!AE13","v":"SS"},{"$f":"IF(D10=\"\",\"Input SF or SS\",\"\")","v":""},null,"TG",200,72600,4,null,null,"6.1","AL 5038",280,70000,2,{"$nulls":4},"SS"]
["Location type",null,"I/IIA/IIB/III/IV",{"$f":"'Worksheet 7'!I14","v":{"v":0,"d":"0.00"}},{"$f":"IF(D11=\"\",\"Input I / IIa,b / III / IV\",\"\")","v":""},null,"CG",300,72600,4,null,null,"3.17.1-4","AMPW",50,7000,2]
["Location area (only loc. III)",null,"F/S/A",{"$f":"'Worksheet 7'!AE16","v":""},{"$f":"IF(D12=\"F\",\"\",IF(D12=\"S\",\"\",IF(D12=\"A\",\"\",IF(D11=\"III\",\"Input F / S / A\",\"\"))))","v":""},null,"AG",40,72600,4,{"$nulls":3},"CG",300,72600,4,{"$nulls":4},"F","Any","yes"]
["Design Category",null,"A/B/C/D",{"$f":"IF('Worksheet 7'!I16=\"\",\"\",'Worksheet 7'!I16)","v":{"v":0,"d":"0.00"}},{"$f":"IF(D13=\"\",\"Input A / B / C / D\",\"\")","v":""},null,"AMPW",50,7000,2,{"$nulls":3},"GRP M30",140,7500,2,{"$nulls":4},"S","M","no"]
["Craft Type Any/Motor/Sail",null,"Any/M/S",{"$f":"'Worksheet 7'!AE18","v":""},{"$f":"IF(D14=\"\",\"Input Any / M / S\",\"\")","v":"Input Any / M / S"},null,"GRP M30",140,7500,2,{"$nulls":3},"GRP M35",175,10000,2,{"$nulls":4},"A","S"]
["optional: craft length of hull",null,"m",{"$f":"'Worksheet 7'!I18","v":{"v":0,"d":"0.00"}},"default, change if smaller",null,"GRP M35",175,10000,2,{"$nulls":3},"MS",400,200000,2]
[{"$nulls":6},"AL 5038",280,70000,2,{"$nulls":3},"PC",90,2400,3.5]
["Material",null,"see Tab. F.1",{"$f":"'Worksheet 7'!I19","v":{"v":0,"d":"0.00"}},{"$f":"IF(D17=\"\",\"manual input requ\",\"\")","v":""},null,"MS",400,200000,2,{"$nulls":3},"PMMA",110,3000,3.5]
["  ultimate flexural strength","Sigma u",null,{"$f":"LOOKUP(D17,N8:N18,O8:O18)","v":{"$error":"#N/A"}},"falls nicht in F.1 ",null,"AISI 316 L",510,200000,2,{"$nulls":3},"TG",200,72600,4]
["  modulus of elasticity","E",null,{"$f":"LOOKUP(D17,N8:N18,P8:P18)","v":{"$error":"#N/A"}},"Werte manuell"]
["  safety factor","gamma",null,{"$f":"LOOKUP(D17,N8:N18,Q8:Q18)","v":{"$error":"#N/A"}},"eintragen"]
[]
["Results for non-stiffened plates"]
["press reduction factor",null,null,{"$f":"IF(D5=\"R\",1.102-0.0004*D7,IF(D5=\"C\",1.102-0.0004*D8))","v":false},"(7.5)"]
["              within limits 0,33 and 1,0","psi",null,{"$f":"IF(D23<0.33,0.33,IF(D23>1,1,D23))","v":{"v":1,"d":"1.000"}},"(7.5)"]
["basic design press","p","KPa",{"$f":"'basic design pressure 7'!G43","v":{"v":1,"d":"1.00"}},"(7.4)",null,"see work sheet \"basic design press\""]
["allowable flexural stress","Sigma a","MPa",{"$f":"D18/D20","v":{"$error":"#N/A"}},"(7.8)",null,"is actual plate a sandwich?",null,{"$f":"'Worksheet 7'!I23","v":0},null,null,{"$f":"IF(I26=\"YES\",\"the difference in thickness between any two glass plies must be less than or equal to 2 mm and the thickness of the plastic interlayer must be less than, or equal to 0,76 mm for these conditions !\",\"\")","v":""}]
["curvature coefficient","kc",null,{"$f":"IF(D5=\"C\",1-(D9/D8),1-(D9/D7))","v":{"$error":"#DIV/0!"}},"(7.6)",null,{"$f":"IF(I26=\"yes\", \"number of layers?\",\"\")","v":""},null,{"$f":"IF('Worksheet 7'!I24=\"\",\"\",'Worksheet 7'!I24)","v":0}]
["              a/b real  (valid ≤ 5)",null,null,{"$f":"IF(D5=\"C\",1,D6/D7)","v":{"$error":"#DIV/0!"}},"(7.3) Annex G.2"]
["              a/b corrected",null,null,{"$f":"IF(D28>5,5,D28)","v":{"$error":"#DIV/0!"}},"(7.3) Annex G.2"]
["plate aspect ratio coeff stress","kr",null,{"$f":"IF(D5=\"R\",IF(D10=\"SF\",(0.62165*D29^2-0.6473*D29+0.26481)/(D29^2-1.173*D29+0.97671),IF(D10=\"SS\",(0.69952*D29^2+0.02662*D29-0.0735)/(D29^2-0.7185*D29+1.98925),\"Fehler\")),IF(D5=\"C\",IF(D10=\"SF\",0.248,0.309),\"FALSCH\"))","v":"FALSCH"},"(7.3) Annex G.2",null,"actual plate Thickness",null,{"$f":"'Worksheet 7'!I25","v":0},"mm",null,{"$f":"IF(I26=\"yes\", \"=sum of all plies\",\"\")","v":""}]
["pate aspect ratio coeff deflection","kf",null,{"$f":"IF(D5=\"R\",IF(D10=\"SF\",(0.08052*D29^2-0.0272*D29-0.0019)/(D29^2-0.9275*D29+1.70018),IF(D10=\"SS\",(0.12915*D29^2+0.00868*D29-0.0293)/(D29^2-0.887*D29+2.3372),\"Fehler\")),IF(D5=\"C\",IF(D10=\"SF\",0.027,0.043)))","v":false},"(7.3) Annex G.2",null,"required plate thickness",null,{"$f":"IF(AND(I26=\"Yes\",I27=\"\"),\"please enter number of layers\",IF(AND(I26=\"Yes\",I27>2),1.5*MAX(D35:D37),IF(AND(I26=\"Yes\",I27=2),1.2*MAX(D35:D37),IF(I36=\"Yes\",MAX(D36:D37),MAX(D35:D37)))))","v":{"$error":"#DIV/0!"}}]
[{"$nulls":6},"requirements fulfilled?",null,{"$f":"IF(I30=\"\",\"\",IF(I30>=I31,\"PASS\",\"FAIL\"))","v":{"$error":"#DIV/0!"}}]
["Thickness (Stress)","tr","mm",{"$f":"IF(D5=\"C\",D8*D27*SQRT(D30*D24*D25/D26/1000),D7*D27*SQRT(D30*D24*D25/D26/1000))","v":{"$error":"#DIV/0!"}},"(7.1.1)"]
["Thickness (Deflection)","tf","mm",{"$f":"0.45*(D33+D7*D27*POWER((D31*D24*D25/0.02/D19/1000),0.33333))","v":{"$error":"#DIV/0!"}},"(7.1.2)"]
["Thickness",null,null,{"$f":"ROUND(MAX(D33:D34),2)","v":{"$error":"#DIV/0!"}},"(7.1.7)",{"$nulls":3},"Minimum tech used???"]
["Thickness minimu, techn. ",null,"mm",{"$f":"D35-0.5","v":{"$error":"#DIV/0!"}},null,null," = Minimum, absolute",null,{"$f":"Summary!P15","v":0}]
["Thickness minimum, Tab 5","tm","mm",{"$f":"'basic design pressure 7'!J48","v":{"v":0,"d":"0.0"}},"(Tab. 5)",null,"(only PMMA, PC, TG, LG)"]
[]
["Escape Hatch possible ?"]
["Required ISO 9094-1, 2"]
["Circular: inner Diam > 450 mm",null,null,{"$f":"IF(D5=\"C\",IF(D8>450,\"pass\",\"fail\"),\"n.a.\")","v":"n.a."}]
["Rectang: inner Diam > 380 mm",null,null,{"$f":"IF(D5=\"R\",IF(MAX(D6:D7)>380,\"pass\",\"fail\"),\"n.a.\")","v":"n.a."}]
["              Area > 180000 mm²",null,null,{"$f":"IF(D5=\"R\",IF(D6*D7>180000,\"pass\",\"fail\"),\"n.a.\")","v":"n.a."}]

{"sheet":"basic design pressure 7","index":24,"n_rows":193,"n_cols":10,"rows_kept":193,"hidden":true}
["Basic design pressure",null,null,"(7.4 Table 4)"]
[]
["location",null,{"$f":"'main Side windows 7'!D11","v":0}]
["particular",null,{"$f":"IF(AND(C5=\"C\",C6=\"M\",C3=\"III\"),\"A\",'main Side windows 7'!D12)","v":""},null,"Remark: f=front, s=side"]
["design cat",null,{"$f":"'main Side windows 7'!D13","v":0}]
["craft type",null,{"$f":"'main Side windows 7'!D14","v":""},{"$f":"IF(C6=\"Any\",\"S\",C6)","v":""},"Remark: if craft type = Any, set craft type = S"]
[]
[]
["Tabelle 4",null,"location","craft type","design cat","particular","pressure"]
[null,null,"I","Any","Any","Any",70]
[null,null,"IIB","Any","A","Any",70]
[null,null,"IIB","Any","B","Any",50]
[null,null,"IIB","Any","C","Any",28]
[null,null,"IIB","Any","D","Any",28]
[null,null,"IIA","Any","Any","Any",28]
[null,null,"III","S","A","Any",18]
[null,null,"III","S","B","Any",18]
[null,null,"III","S","C","Any",12]
[null,null,"III","S","D","Any",12]
[null,null,"III","M","A","Front",12]
[null,null,"III","M","A","Any",12]
[null,null,"III","M","B","Front",9]
[null,null,"III","M","B","Any",9]
[null,null,"III","M","D","Front",6,null,null,"Korrektur, Zeile eingefügt um Fehler bei eingabe III, M, Front, D zu beheben"]
[null,null,"III","M","A","Side",9]
[null,null,"III","M","B","Side",6]
[null,null,"III","M","C","Any",6]
[null,null,"III","M","D","Any",6]
[null,null,"IV","S","Any","Any",12]
[null,null,"IV","M","Any","Any",6]
[]
["Ergebnis"]
[null,"location = I",{"$nulls":4},{"$f":"IF(C3=\"I\",G10,0)","v":0}]
[null,"location = IIB",{"$nulls":4},{"$f":"IF(C3=\"IIB\",VLOOKUP(C5,E11:G15,3),0)","v":0}]
[null,"location = IIA",{"$nulls":4},{"$f":"IF(C3=\"IIA\",VLOOKUP(C3,E11:G15,3),0)","v":0}]
[null,"location = III","craft = S",{"$nulls":3},{"$f":"IF(AND(C3=\"III\",D6=\"S\"),VLOOKUP(C5,E16:G19,3),0)","v":0}]
[null,"location = III","craft = M","particular = front",null,null,{"$f":"IF(AND(C3=\"III\",D6=\"M\",C4=\"F\"),VLOOKUP(C5,E20:G24,3),0)","v":0}]
[null,"location = III","craft = M","particular = any",null,null,{"$f":"IF(AND(OR(C5=\"A\",C5=\"B\"),C3=\"III\",D6=\"M\",C4=\"A\"),VLOOKUP(C5,E20:G24,3),0)","v":0}]
[null,"location = III","craft = M","particular = side",null,null,{"$f":"IF(AND(C3=\"III\",C6=\"M\",C4=\"S\"),IF(C5=\"A\",9,IF(C5=\"B\",6,0)))","v":false}]
[null,"location = III","craft = M",{"$nulls":3},{"$f":"IF(C5=\"A\",0,IF(C5=\"B\",0,IF(AND(C3=\"III\",C6=\"M\"),VLOOKUP(C5,E27:G28,3))))","v":false}]
[null,"location = IV",{"$nulls":4},{"$f":"IF(C3=\"IV\",VLOOKUP(D6,D29:G30,4,0),1)","v":1}]
[]
["pressure",{"$nulls":5},{"$f":"MAX(G33:G41)","v":1}]
[]
[]
["minimum thickness"]
[]
[null,"Area",{"$f":"IF(OR('main Side windows 7'!D11=\"IIA\",'main Side windows 7'!D11=\"IIB\"),\"II\",'main Side windows 7'!D11)","v":0},{"$nulls":4},"minimum thickness",null,{"$f":"MAX(J50:J190)","v":0}]
[]
[null,null,"PMMA","A","I",{"$f":" IF('main Side windows 7'!$D$15>0,6 + 0.1*('main Side windows 7'!$D$15-4),\"\")","v":""},{"$nulls":3},{"$f":"IF('main Side windows 7'!$D$17=\"PMMA\",(IF('main Side windows 7'!$D$13=\"A\",VLOOKUP($C$48,$E$50:$F$53,2,-1),0)),0)","v":0}]
["Table 5",{"$nulls":3},"II",6]
[{"$nulls":4},"III",5]
[{"$nulls":4},"IV",5]
[null,null,"PMMA","B","I",{"$f":" IF('main Side windows 7'!$D$15>0,6 + 0.1*('main Side windows 7'!$D$15-4),\"\")","v":""},{"$nulls":3},{"$f":"IF('main Side windows 7'!$D$17=\"PMMA\",(IF('main Side windows 7'!$D$13=\"B\",VLOOKUP($C$48,$E$54:$F$57,2,-1),0)),0)","v":0}]
[{"$nulls":4},"II",6]
[{"$nulls":4},"III",5]
[{"$nulls":4},"IV",5]
[null,null,"PMMA","C","I",{"$f":" IF('main Side windows 7'!$D$15>0,6 + 0.1*('main Side windows 7'!$D$15-4),\"\")","v":""},{"$nulls":3},{"$f":"IF('main Side windows 7'!$D$17=\"PMMA\",(IF('main Side windows 7'!$D$13=\"C\",VLOOKUP($C$48,$E$58:$F$61,2,-1),0)),0)","v":0}]
[{"$nulls":4},"II",6]
[{"$nulls":4},"III",4]
[{"$nulls":4},"IV",4]
[null,null,"PMMA","D","I",{"$f":" IF('main Side windows 7'!$D$15>0,6 + 0.1*('main Side windows 7'!$D$15-4),\"\")","v":""},{"$nulls":3},{"$f":"IF('main Side windows 7'!$D$17=\"PMMA\",(IF('main Side windows 7'!$D$13=\"D\",VLOOKUP($C$48,E62:F65,2,-1),0)),0)","v":0}]
[{"$nulls":4},"II",6]
[{"$nulls":4},"III",4]
[{"$nulls":4},"IV",4]
[null,null,"PC","A","I",{"$f":" IF('main Side windows 7'!$D$15>0,6 + 0.1*('main Side windows 7'!$D$15-4),\"\")","v":""},{"$nulls":3},{"$f":"IF('main Side windows 7'!$D$17=\"PC\",(IF('main Side windows 7'!$D$13=\"A\",VLOOKUP($C$48,E66:F69,2,-1),0)),0)","v":0}]
[{"$nulls":4},"II",6]
[{"$nulls":4},"III",5]
[{"$nulls":4},"IV",5]
[null,null,"PC","B","I",{"$f":" IF('main Side windows 7'!$D$15>0,6 + 0.1*('main Side windows 7'!$D$15-4),\"\")","v":""},{"$nulls":3},{"$f":"IF('main Side windows 7'!$D$17=\"PC\",(IF('main Side windows 7'!$D$13=\"B\",VLOOKUP($C$48,E70:F73,2,-1),0)),0)","v":0}]
[{"$nulls":4},"II",6]
[{"$nulls":4},"III",5]
[{"$nulls":4},"IV",5]
[null,null,"PC","C","I",{"$f":" IF('main Side windows 7'!$D$15>0,6 + 0.1*('main Side windows 7'!$D$15-4),\"\")","v":""},{"$nulls":3},{"$f":"IF('main Side windows 7'!$D$17=\"PC\",(IF('main Side windows 7'!$D$13=\"C\",VLOOKUP($C$48,E74:F77,2,-1),0)),0)","v":0}]
[{"$nulls":4},"II",6]
[{"$nulls":4},"III",4]
[{"$nulls":4},"IV",4]
[null,null,"PC","D","I",{"$f":" IF('main Side windows 7'!$D$15>0,6 + 0.1*('main Side windows 7'!$D$15-4),\"\")","v":""},{"$nulls":3},{"$f":"IF('main Side windows 7'!$D$17=\"PC\",(IF('main Side windows 7'!$D$13=\"D\",VLOOKUP($C$48,E78:F81,2,-1),0)),0)","v":0}]
[{"$nulls":4},"II",6]
[{"$nulls":4},"III",4]
[{"$nulls":4},"IV",4]
[null,null,"TG","A","I",{"$f":" IF('main Side windows 7'!$D$15>0,5+ 0.1*('main Side windows 7'!$D$15-4),\"\")","v":""},{"$nulls":3},{"$f":"IF('main Side windows 7'!$D$17=\"TG\",(IF('main Side windows 7'!$D$13=\"A\",VLOOKUP($C$48,E82:F85,2,-1),0)),0)","v":0}]
[{"$nulls":4},"II",4]
[{"$nulls":4},"III",4]
[{"$nulls":4},"IV",4]
[null,null,"TG","B","I",{"$f":" IF('main Side windows 7'!$D$15>0,5+ 0.1*('main Side windows 7'!$D$15-4),\"\")","v":""},{"$nulls":3},{"$f":"IF('main Side windows 7'!$D$17=\"TG\",(IF('main Side windows 7'!$D$13=\"B\",VLOOKUP($C$48,E86:F89,2,-1),0)),0)","v":0}]
[{"$nulls":4},"II",4]
[{"$nulls":4},"III",4]
[{"$nulls":4},"IV",4]
[null,null,"TG","C","I",{"$f":" IF('main Side windows 7'!$D$15>0,5+ 0.1*('main Side windows 7'!$D$15-4),\"\")","v":""},{"$nulls":3},{"$f":"IF('main Side windows 7'!$D$17=\"TG\",(IF('main Side windows 7'!$D$13=\"C\",VLOOKUP($C$48,E90:F93,2,-1),0)),0)","v":0}]
[{"$nulls":4},"II",4]
[{"$nulls":4},"III",3]
[{"$nulls":4},"IV",3]
[null,null,"TG","D","I",{"$f":" IF('main Side windows 7'!$D$15>0,5+ 0.1*('main Side windows 7'!$D$15-4),\"\")","v":""},{"$nulls":3},{"$f":"IF('main Side windows 7'!$D$17=\"TG\",(IF('main Side windows 7'!$D$13=\"D\",VLOOKUP($C$48,E94:F97,2,-1),0)),0)","v":0}]
[{"$nulls":4},"II",4]
[{"$nulls":4},"III",3]
[{"$nulls":4},"IV",3]
[null,null,"LG","A","I",{"$f":" IF('main Side windows 7'!$D$15>0,5+ 0.1*('main Side windows 7'!$D$15-4),\"\")","v":""},{"$nulls":3},{"$f":"IF('main Side windows 7'!$D$17=\"LG\",(IF('main Side windows 7'!$D$13=\"A\",VLOOKUP($C$48,E98:F101,2,-1),0)),0)","v":0}]
[{"$nulls":4},"II",4]
[{"$nulls":4},"III",4]
[{"$nulls":4},"IV",4]
[null,null,"LG","B","I",{"$f":" IF('main Side windows 7'!$D$15>0,5+ 0.1*('main Side windows 7'!$D$15-4),\"\")","v":""},{"$nulls":3},{"$f":"IF('main Side windows 7'!$D$17=\"LG\",(IF('main Side windows 7'!$D$13=\"B\",VLOOKUP($C$48,E102:F105,2,-1),0)),0)","v":0}]
[{"$nulls":4},"II",4]
[{"$nulls":4},"III",4]
[{"$nulls":4},"IV",4]
[null,null,"LG","C","I",{"$f":" IF('main Side windows 7'!$D$15>0,5+ 0.1*('main Side windows 7'!$D$15-4),\"\")","v":""},{"$nulls":3},{"$f":"IF('main Side windows 7'!$D$17=\"LG\",(IF('main Side windows 7'!$D$13=\"C\",VLOOKUP($C$48,E106:F109,2,-1),0)),0)","v":0}]
[{"$nulls":4},"II",4]
[{"$nulls":4},"III",3]
[{"$nulls":4},"IV",3]
[null,null,"LG","D","I",{"$f":" IF('main Side windows 7'!$D$15>0,5+ 0.1*('main Side windows 7'!$D$15-4),\"\")","v":""},{"$nulls":3},{"$f":"IF('main Side windows 7'!$D$17=\"LG\",(IF('main Side windows 7'!$D$13=\"D\",VLOOKUP($C$48,E110:F113,2,-1),0)),0)","v":0}]
[{"$nulls":4},"II",4]
[{"$nulls":4},"III",3]
[{"$nulls":4},"IV",3]
[null,null,"AMPW","A","I",{"$f":" IF('main Side windows 7'!$D$15>0,8+ 0.1*('main Side windows 7'!$D$15-4),\"\")","v":""},{"$nulls":3},{"$f":"IF('main Side windows 7'!$D$17=\"AMPW\",(IF('main Side windows 7'!$D$13=\"A\",VLOOKUP($C$48,E114:F117,2,-1),0)),0)","v":0}]
[{"$nulls":4},"II",6]
[{"$nulls":4},"III",5]
[{"$nulls":4},"IV",5]
[null,null,"AMPW","B","I",{"$f":" IF('main Side windows 7'!$D$15>0,8+ 0.1*('main Side windows 7'!$D$15-4),\"\")","v":""},{"$nulls":3},{"$f":"IF('main Side windows 7'!$D$17=\"AMPW\",(IF('main Side windows 7'!$D$13=\"B\",VLOOKUP($C$48,E118:F121,2,-1),0)),0)","v":0}]
[{"$nulls":4},"II",6]
[{"$nulls":4},"III",5]
[{"$nulls":4},"IV",5]
[null,null,"AMPW","C","I",{"$f":" IF('main Side windows 7'!$D$15>0,8+ 0.1*('main Side windows 7'!$D$15-4),\"\")","v":""},{"$nulls":3},{"$f":"IF('main Side windows 7'!$D$17=\"AMPW\",(IF('main Side windows 7'!$D$13=\"C\",VLOOKUP($C$48,E122:F125,2,-1),0)),0)","v":0}]
[{"$nulls":4},"II",6]
[{"$nulls":4},"III",4]
[{"$nulls":4},"IV",4]
[null,null,"AMPW","D","I",{"$f":" IF('main Side windows 7'!$D$15>0,8+ 0.1*('main Side windows 7'!$D$15-4),\"\")","v":""},{"$nulls":3},{"$f":"IF('main Side windows 7'!$D$17=\"AMPW\",(IF('main Side windows 7'!$D$13=\"D\",VLOOKUP($C$48,E126:F129,2,-1),0)),0)","v":0}]
[{"$nulls":4},"II",6]
[{"$nulls":4},"III",4]
[{"$nulls":4},"IV",4]
[null,null,"GRP m30","A","I",{"$f":" IF('main Side windows 7'!$D$15>0,4 + 0.1*('main Side windows 7'!$D$15-4),\"\")","v":""},{"$nulls":3},{"$f":"IF('main Side windows 7'!$D$17=\"GRP M30\",(IF('main Side windows 7'!$D$13=\"A\",VLOOKUP($C$48,E130:F133,2,-1),0)),0)","v":0}]
[{"$nulls":4},"II",3]
[{"$nulls":4},"III",3]
[{"$nulls":4},"IV",3]
[null,null,"GRP m30","B","I",{"$f":" IF('main Side windows 7'!$D$15>0,4 + 0.1*('main Side windows 7'!$D$15-4),\"\")","v":""},{"$nulls":3},{"$f":"IF('main Side windows 7'!$D$17=\"GRP M30\",(IF('main Side windows 7'!$D$13=\"B\",VLOOKUP($C$48,E134:F137,2,-1),0)),0)","v":0}]
[{"$nulls":4},"II",3]
[{"$nulls":4},"III",3]
[{"$nulls":4},"IV",3]
[null,null,"GRP m30","C","I",{"$f":" IF('main Side windows 7'!$D$15>0,4 + 0.1*('main Side windows 7'!$D$15-4),\"\")","v":""},{"$nulls":3},{"$f":"IF('main Side windows 7'!$D$17=\"GRP M30\",(IF('main Side windows 7'!$D$13=\"C\",VLOOKUP($C$48,E138:F141,2,-1),0)),0)","v":0}]
[{"$nulls":4},"II",3]
[{"$nulls":4},"III",2]
[{"$nulls":4},"IV",2]
[null,null,"GRP m30","D","I",{"$f":" IF('main Side windows 7'!$D$15>0,4 + 0.1*('main Side windows 7'!$D$15-4),\"\")","v":""},{"$nulls":3},{"$f":"IF('main Side windows 7'!$D$17=\"GRP M30\",(IF('main Side windows 7'!$D$13=\"D\",VLOOKUP($C$48,E142:F145,2,-1),0)),0)","v":0}]
[{"$nulls":4},"II",3]
[{"$nulls":4},"III",2]
[{"$nulls":4},"IV",2]
[null,null,"GRP m35","A","I",{"$f":" IF('main Side windows 7'!$D$15>0,4 + 0.1*('main Side windows 7'!$D$15-4),\"\")","v":""},{"$nulls":3},{"$f":"IF('main Side windows 7'!$D$17=\"GRP M35\",(IF('main Side windows 7'!$D$13=\"A\",VLOOKUP($C$48,E146:F149,2,-1),0)),0)","v":0}]
[{"$nulls":4},"II",3]
[{"$nulls":4},"III",3]
[{"$nulls":4},"IV",3]
[null,null,"GRP m35","B","I",{"$f":" IF('main Side windows 7'!$D$15>0,4 + 0.1*('main Side windows 7'!$D$15-4),\"\")","v":""},{"$nulls":3},{"$f":"IF('main Side windows 7'!$D$17=\"GRP M35\",(IF('main Side windows 7'!$D$13=\"B\",VLOOKUP($C$48,E150:F153,2,-1),0)),0)","v":0}]
[{"$nulls":4},"II",3]
[{"$nulls":4},"III",3]
[{"$nulls":4},"IV",3]
[null,null,"GRP m35","C","I",{"$f":" IF('main Side windows 7'!$D$15>0,4 + 0.1*('main Side windows 7'!$D$15-4),\"\")","v":""},{"$nulls":3},{"$f":"IF('main Side windows 7'!$D$17=\"GRP M35\",(IF('main Side windows 7'!$D$13=\"C\",VLOOKUP($C$48,E154:F157,2,-1),0)),0)","v":0}]
[{"$nulls":4},"II",3]
[{"$nulls":4},"III",2]
[{"$nulls":4},"IV",2]
[null,null,"GRP m35","D","I",{"$f":" IF('main Side windows 7'!$D$15>0,4 + 0.1*('main Side windows 7'!$D$15-4),\"\")","v":""},{"$nulls":3},{"$f":"IF('main Side windows 7'!$D$17=\"GRP M35\",(IF('main Side windows 7'!$D$13=\"D\",VLOOKUP($C$48,E158:F161,2,-1),0)),0)","v":0}]
[{"$nulls":4},"II",3]
[{"$nulls":4},"III",2]
[{"$nulls":4},"IV",2]
[null,null,"Al 5038","A","I",{"$f":" IF('main Side windows 7'!$D$15>0,3 + 0.05*('main Side windows 7'!$D$15-4),\"\")","v":""},{"$nulls":3},{"$f":"IF('main Side windows 7'!$D$17=\"Al 5038\",(IF('main Side windows 7'!$D$13=\"A\",VLOOKUP($C$48,E162:F165,2,-1),0)),0)","v":0}]
[{"$nulls":4},"II",3]
[{"$nulls":4},"III",3]
[{"$nulls":4},"IV",3]
[null,null,"Al 5038","B","I",{"$f":" IF('main Side windows 7'!$D$15>0,3 + 0.05*('main Side windows 7'!$D$15-4),\"\")","v":""},{"$nulls":3},{"$f":"IF('main Side windows 7'!$D$17=\"AL 5038\",(IF('main Side windows 7'!$D$13=\"B\",VLOOKUP($C$48,E166:F169,2,-1),0)),0)","v":0}]
[{"$nulls":4},"II",3]
[{"$nulls":4},"III",3]
[{"$nulls":4},"IV",3]
[null,null,"Al 5038","C","I",{"$f":" IF('main Side windows 7'!$D$15>0,3 + 0.05*('main Side windows 7'!$D$15-4),\"\")","v":""},{"$nulls":3},{"$f":"IF('main Side windows 7'!$D$17=\"AL 5038\",(IF('main Side windows 7'!$D$13=\"C\",VLOOKUP($C$48,E170:F173,2,-1),0)),0)","v":0}]
[{"$nulls":4},"II",3]
[{"$nulls":4},"III",2]
[{"$nulls":4},"IV",2]
[null,null,"Al 5038","D","I",{"$f":" IF('main Side windows 7'!$D$15>0,3 + 0.05*('main Side windows 7'!$D$15-4),\"\")","v":""},{"$nulls":3},{"$f":"IF('main Side windows 7'!$D$17=\"AL 5038\",(IF('main Side windows 7'!$D$13=\"D\",VLOOKUP($C$48,E174:F177,2,-1),0)),0)","v":0}]
[{"$nulls":4},"II",3]
[{"$nulls":4},"III",2]
[{"$nulls":4},"IV",2]
[null,null,"MS","A","I",{"$f":" IF('main Side windows 7'!$D$15>0,2.5 + 0.025*('main Side windows 7'!$D$15-4),\"\")","v":""},{"$nulls":3},{"$f":"IF('main Side windows 7'!$D$17=\"MS\",(IF('main Side windows 7'!$D$13=\"A\",VLOOKUP($C$48,E178:F181,2,-1),0)),0)","v":0}]
[{"$nulls":4},"II",2.5]
[{"$nulls":4},"III",2.5]
[{"$nulls":4},"IV",2.5]
[null,null,"MS","B","I",{"$f":" IF('main Side windows 7'!$D$15>0,2.5 + 0.025*('main Side windows 7'!$D$15-4),\"\")","v":""},{"$nulls":3},{"$f":"IF('main Side windows 7'!$D$17=\"MS\",(IF('main Side windows 7'!$D$13=\"B\",VLOOKUP($C$48,E182:F185,2,-1),0)),0)","v":0}]
[{"$nulls":4},"II",2.5]
[{"$nulls":4},"III",2.5]
[{"$nulls":4},"IV",2.5]
[null,null,"MS","C","I",{"$f":" IF('main Side windows 7'!$D$15>0,2.5 + 0.025*('main Side windows 7'!$D$15-4),\"\")","v":""},{"$nulls":3},{"$f":"IF('main Side windows 7'!$D$17=\"MS\",(IF('main Side windows 7'!$D$13=\"C\",VLOOKUP($C$48,E186:F189,2,-1),0)),0)","v":0}]
[{"$nulls":4},"II",2.5]
[{"$nulls":4},"III",2]
[{"$nulls":4},"IV",2]
[null,null,"MS","D","I",{"$f":" IF('main Side windows 7'!$D$15>0,2.5 + 0.025*('main Side windows 7'!$D$15-4),\"\")","v":""},{"$nulls":3},{"$f":"IF('main Side windows 7'!$D$17=\"MS\",(IF('main Side windows 7'!$D$13=\"D\",VLOOKUP($C$48,E190:F193,2,-1),0)),0)","v":0}]
[{"$nulls":4},"II",2.5]
[{"$nulls":4},"III",2]
[{"$nulls":4},"IV",2]

{"sheet":"Worksheet 8","index":25,"n_rows":45,"n_cols":31,"rows_kept":45,"merged":[[0,0,0,9],[0,11,0,12],[1,0,1,9],[2,0,2,9],[4,0,4,9],[6,0,6,5],[17,13,17,14],[19,13,19,14],[21,12,21,14],[22,15,26,18],[27,6,28,6],[27,7,28,7],[27,15,27,21],[29,15,32,15],[29,16,32,16],[29,17,32,17],[29,18,29,21],[30,18,30,21],[31,18,31,19],[32,11,32,13],[34,13,34,14],[36,13,36,14],[38,13,38,14],[39,13,39,14],[41,13,41,14]]}
[{"$nulls":11},"Comments"]
["ISO 12216:2020 - Small craft - Windows, portlights, hatches, deadlights and doors",{"$nulls":11},"Derived values"]
["WORKSHEET No. 1 data entry",{"$nulls":11},"Input values"]
[]
[{"$f":"CONCATENATE(coverSheet!B5,\"   \",coverSheet!B12,\"   \",Summary!B16)","v":"      "}]
[]
["Parameter",{"$nulls":5},"Symbol","Unit","Value","Ref.",{"$nulls":5},"Material Properties see table F.1 and Tab. 5",{"$nulls":11},"List"]
["Form of plate (Rectangular / Circle)",{"$nulls":5},"R / C",null,{"$f":"Summary!C16","v":0},"Annex C",{"$nulls":5},"Table F.1 mechanical properties [MPa]",null,null,"Tab. 5",{"$nulls":8},"Lists"]
["Long side",{"$nulls":5},"a","mm",{"$f":"Summary!D16","v":0},"7.3, Annex C",{"$nulls":5},"Material","strength","elasticity","safety",{"$nulls":7},"rectangular","R","I","A",{"$f":"IF(I8=\"rectangular\",\"R\",IF(I8=\"circle\",\"C\",\"\"))","v":""}]
["Unsupported short side",{"$nulls":5},"b","mm",{"$f":"Summary!E16","v":0},"7.3, Annex C",{"$nulls":5},"PMMA",110,3000,3.5,{"$nulls":7},"circle","C","IIa","B"]
["Diameter",{"$nulls":5},"d","mm",{"$f":"Summary!F16","v":0},"7.3, Annex C",{"$nulls":5},"PC",90,2400,3.5,{"$nulls":9},"IIb","C"]
["Curve height",{"$nulls":5},"c","mm",{"$f":"Summary!G16","v":0},"7.6",{"$nulls":5},"TG",200,72600,4,{"$nulls":9},"III","D"]
["Support SemiFixed / Simply Supported",{"$nulls":5},"SF / SS",null,{"$f":"Summary!H16","v":0},"3.18",{"$nulls":5},"CG",300,72600,4,{"$nulls":7},"semi-fixed","SF","IV",null,{"$f":"IF(I13=\"semi-fixed\",\"SF\",IF(I13=\"\",\"\",\"SS\"))","v":"SS"}]
["Location type",{"$nulls":5},"I/IIA/IIB/III/IV",null,{"$f":"Summary!I16","v":0},"3.17; Annex A",{"$nulls":5},"AG",40,72600,4,{"$nulls":7},"simply supported","SS"]
["Location area (only loc. III)",{"$nulls":5},"F / S / Any",null,{"$f":"Summary!J16","v":0},"3.17.4",{"$nulls":5},"AMPW",50,7000,2]
["Design Category",{"$nulls":5},"A / B / C / D",null,{"$f":"Summary!K16","v":0},"3.12",{"$nulls":5},"GRP M30",140,7500,2,{"$nulls":6},"any","front","F","Any","yes",{"$f":"IF(I15=\"front\",\"F\",IF(I15=\"side\",\"S\",IF(I15=\"any\",\"A\",\"\")))","v":""}]
["Craft Type Any/Motor/Sail",{"$nulls":5},"Any / M / S",null,{"$f":"Summary!L16","v":0},{"$nulls":6},"GRP M35",175,10000,2,{"$nulls":6},"motor","side","S","M","no"]
["Length of hull as in ISO 8666",{"$nulls":5},"LH","m",{"$f":"Summary!N16","v":{"v":0,"d":"0.00"}},"3.16",{"$nulls":5},"AL 5038",280,70000,2,{"$nulls":6},"sail","any","Any","S",null,{"$f":"IF(I17=\"any\",\"Any\",IF(I17=\"motor\",\"M\",IF(I17=\"sail\",\"S\",\"\")))","v":""}]
["Material data",{"$nulls":7},{"$f":"Summary!O16","v":0},"Table F.1 & 5",{"$nulls":5},"MS",400,200000,2]
[null,"  Ultimate flexural strength",{"$nulls":4},"σU","MPa",{"$f":"'main Side windows 8'!D18","v":{"$error":"#N/A"}},"Table F.1 & 5",{"$nulls":5},"AISI 316 L",510,200000,2]
[null,"  Modulus of elasticity",{"$nulls":4},"E","MPa",{"$f":"'main Side windows 8'!D19","v":{"$error":"#N/A"}},"Table F.1 & 5"]
[null,"  Safety factor",{"$nulls":4},"gamma",". / .",{"$f":"'main Side windows 8'!D20","v":{"$error":"#N/A"}},"Table F.1 & 5",{"$nulls":15},"yes"]
["Is actual plate a sandwich?",{"$nulls":5},"yes / no",null,{"$f":"Summary!Q16","v":0},"7.9",{"$nulls":5},{"$f":"IF(I23=\"YES\",\"The difference in thickness between any two glass plies must be less than or equal to 2 mm and the thickness of the plastic interlayer must be less than, or equal to 0,76 mm for these conditions !\",\"\")","v":""},{"$nulls":9},"no"]
[null,"If yes, enter number of layers",{"$nulls":5},". / .",{"$f":"Summary!R16","v":0},"7.9"]
["Actual plate thickness (in case of sandwich the sum of all layers)",{"$nulls":6},"mm",{"$f":"Summary!U16","v":{"v":0,"d":"0.00"}}]
[]
["Results for non-stiffened plates"]
["Press reduction factor",{"$nulls":5},"Ψ",". / .",{"$f":"'main Side windows 8'!D23","v":false},"7.5"]
["              within limits 0,33 and 1,0",{"$nulls":7},{"$f":"'main Side windows 8'!D24","v":1},"7.5",{"$nulls":5},"Table 5 — Safety factor and minimum thickness of monolithic plates"]
["Basic design press",{"$nulls":5},"p","kPa",{"$f":"'main Side windows 8'!D25","v":1},"7.4",{"$nulls":5},"Material","Acronym","Safety factor\n γ ","Minimum thickness of monolithic plates, tm"]
["Allowable flexural stress",{"$nulls":5},"σa","MPa",{"$f":"'main Side windows 8'!D26","v":{"$error":"#N/A"}},"7.8",{"$nulls":8},"Design categories "]
["Curvature coefficient",{"$nulls":5},"kC",". / .",{"$f":"'main Side windows 8'!D27","v":{"$error":"#DIV/0!"}},"7.6",{"$nulls":8},"Any",null,"A & B","C & D"]
["Ratio a/b (valid ≤ 5)",{"$nulls":6},". / .",{"$f":"'main Side windows 8'!D28","v":{"$error":"#DIV/0!"}},"7.3, Annex G.2",{"$nulls":8},"Area Ia","Area II","Area III & IV","Area III & IV"]
["Ratio a/b corrected",{"$nulls":6},". / .",{"$f":"'main Side windows 8'!D29","v":{"$error":"#DIV/0!"}},"7.3, Annex G.2",{"$nulls":5},"Poly(methyl)methacrylate","PMMA",3.5,"6+0,1(LH-4)",6,5,4]
["Plate aspect ratio coeff stress",{"$nulls":5},"kr",". / .",{"$f":"'main Side windows 8'!D30","v":"FALSCH"},"7.3, Annex G.2",{"$nulls":5},"Polycarbonate","PC",3.5,"6+0,1(LH-4)",6,5,4]
["Pate aspect ratio coeff deflection",{"$nulls":5},"kf",". / .",{"$f":"'main Side windows 8'!D31","v":false},"7.3, Annex G.2",{"$nulls":5},"Monolithic tempered glass ","TG",4,"5+0,1(LH-4)b",4,4,3]
[{"$nulls":15},"Laminated glass ","LG",4,"5+0,1(LH-4)b",4,4,3]
["Thickness (Stress)",{"$nulls":5},"tr","mm",{"$f":"'main Side windows 8'!D33","v":{"$error":"#DIV/0!"}},"7.1.1",{"$nulls":5},"All mahogany plywood ","AMPW",2,"8+0,1(LH-4)",6,5,4]
["Thickness (Deflection)",{"$nulls":5},"tf","mm",{"$f":"'main Side windows 8'!D34","v":{"$error":"#DIV/0!"}},"7.1.2",{"$nulls":5},"GRP mat 30 % glass ","GRP M30",2,"4+0,1(LH-4)",3,3,2]
["Thickness",{"$nulls":6},"mm",{"$f":"'main Side windows 8'!D35","v":{"$error":"#DIV/0!"}},{"$nulls":6},"GRP mat/roving 35 % glass ","GRP M35",2,"4+0,1(LH-4)",3,3,2]
["Thickness minimu, techn. ",{"$nulls":5},"tm","mm",{"$f":"'main Side windows 8'!D36","v":{"$error":"#DIV/0!"}},"7.8",{"$nulls":5},"Aluminium alloy 5083-H111 ","AL 5038",2,"3+0,05 (LH-4)",3,3,2]
["Thickness minimum, Tab 5",{"$nulls":6},"mm",{"$f":"'main Side windows 8'!D37","v":{"v":0,"d":"0.0"}},"Table 5",{"$nulls":5},"Mild steel ","MS",2,"2,5+0,025 (LH-4)",2.5,2.5,2]
[]
["Required plate thickness",{"$nulls":6},"mm",{"$f":"'main Side windows 8'!I31","v":{"$error":"#DIV/0!"}}]
["Requirements fullfilled?",{"$nulls":7},{"$f":"IF(L13=\"short side in area I max 300mm\",\"FAIL\",IF(I25>=I44,\"PASS\",\"FAIL\"))","v":{"$error":"#DIV/0!"}}]

{"sheet":"main Side windows 8","index":26,"n_rows":43,"n_cols":24,"rows_kept":43,"hidden":true,"merged":[[0,0,0,5],[1,0,1,5],[25,11,28,18],[26,6,26,7]]}
[{"$nulls":6},"manufacturer"]
[{"$nulls":6},"model name"]
["Eingabe","Version 1.2.2 / 15-03-2006 rev 060512/070507/dew 090918",{"$nulls":4},"ISO/FDIS 12216:2002(E)"]
["Parameter Input","SSign","Item/Unit",{"$nulls":18},"Lists"]
["form of plate Rectangular/Circle",null,"R/C",{"$f":"'Worksheet 8'!AE9","v":""},{"$f":"IF(D5=\"\",\"Input R oder C\",\"\")","v":"Input R oder C"},null,"Material Properties see table F.1 and Tab. 5",{"$nulls":14},"R","I","A"]
["long side","a","mm",{"$f":"'Worksheet 8'!I9","v":0},{"$f":"IF(AND(D5=\"R\",D6=\"\"),\"Input a requested\",IF(AND(D5=\"C\",D6=\"\"),\"Input d requested\",\"\"))","v":""},null,"Table F.1 mechanical properties [Mpa]",null,null,"Tab. 5",{"$nulls":11},"C","IIa","B"]
["unsupported short side","b","mm",{"$f":"'Worksheet 8'!I10","v":0},{"$f":"IF(AND(D5=\"R\",D7=\"\"),\"Input b requested\",IF(AND(D5=\"C\",D7=\"\"),\"Input d requested\",\"\"))","v":""},null,"Material","strength","elasticity","safety",{"$nulls":12},"IIb","C"]
["diameter","d","mm",{"$f":"'Worksheet 8'!I11","v":0},{"$f":"IF(AND(D5=\"C\",D8=\"\"),\"Input d requested\",\"\")","v":""},null,"PMMA",110,3000,3.5,{"$nulls":3},"AG",40,72600,4,{"$nulls":5},"III","D"]
["curve height","c","mm",{"$f":"'Worksheet 8'!I12","v":0},"optional",null,"PC",90,2400,3.5,{"$nulls":3},"AISI 316 L",510,200000,2,{"$nulls":4},"SF","IV"]
["support SemiFixed/Simple Supp.",null,"SF/SS",{"$f":"'Worksheet 8'!AE13","v":"SS"},{"$f":"IF(D10=\"\",\"Input SF or SS\",\"\")","v":""},null,"TG",200,72600,4,null,null,"6.1","AL 5038",280,70000,2,{"$nulls":4},"SS"]
["Location type",null,"I/IIA/IIB/III/IV",{"$f":"'Worksheet 8'!I14","v":{"v":0,"d":"0.00"}},{"$f":"IF(D11=\"\",\"Input I / IIa,b / III / IV\",\"\")","v":""},null,"CG",300,72600,4,null,null,"3.17.1-4","AMPW",50,7000,2]
["Location area (only loc. III)",null,"F/S/A",{"$f":"'Worksheet 8'!AE16","v":""},{"$f":"IF(D12=\"F\",\"\",IF(D12=\"S\",\"\",IF(D12=\"A\",\"\",IF(D11=\"III\",\"Input F / S / A\",\"\"))))","v":""},null,"AG",40,72600,4,{"$nulls":3},"CG",300,72600,4,{"$nulls":4},"F","Any","yes"]
["Design Category",null,"A/B/C/D",{"$f":"IF('Worksheet 8'!I16=\"\",\"\",'Worksheet 8'!I16)","v":{"v":0,"d":"0.00"}},{"$f":"IF(D13=\"\",\"Input A / B / C / D\",\"\")","v":""},null,"AMPW",50,7000,2,{"$nulls":3},"GRP M30",140,7500,2,{"$nulls":4},"S","M","no"]
["Craft Type Any/Motor/Sail",null,"Any/M/S",{"$f":"'Worksheet 8'!AE18","v":""},{"$f":"IF(D14=\"\",\"Input Any / M / S\",\"\")","v":"Input Any / M / S"},null,"GRP M30",140,7500,2,{"$nulls":3},"GRP M35",175,10000,2,{"$nulls":4},"A","S"]
["optional: craft length of hull",null,"m",{"$f":"'Worksheet 8'!I18","v":{"v":0,"d":"0.00"}},"default, change if smaller",null,"GRP M35",175,10000,2,{"$nulls":3},"MS",400,200000,2]
[{"$nulls":6},"AL 5038",280,70000,2,{"$nulls":3},"PC",90,2400,3.5]
["Material",null,"see Tab. F.1",{"$f":"'Worksheet 8'!I19","v":{"v":0,"d":"0.00"}},{"$f":"IF(D17=\"\",\"manual input requ\",\"\")","v":""},null,"MS",400,200000,2,{"$nulls":3},"PMMA",110,3000,3.5]
["  ultimate flexural strength","Sigma u",null,{"$f":"LOOKUP(D17,N8:N18,O8:O18)","v":{"$error":"#N/A"}},"falls nicht in F.1 ",null,"AISI 316 L",510,200000,2,{"$nulls":3},"TG",200,72600,4]
["  modulus of elasticity","E",null,{"$f":"LOOKUP(D17,N8:N18,P8:P18)","v":{"$error":"#N/A"}},"Werte manuell"]
["  safety factor","gamma",null,{"$f":"LOOKUP(D17,N8:N18,Q8:Q18)","v":{"$error":"#N/A"}},"eintragen"]
[]
["Results for non-stiffened plates"]
["press reduction factor",null,null,{"$f":"IF(D5=\"R\",1.102-0.0004*D7,IF(D5=\"C\",1.102-0.0004*D8))","v":false},"(7.5)"]
["              within limits 0,33 and 1,0","psi",null,{"$f":"IF(D23<0.33,0.33,IF(D23>1,1,D23))","v":{"v":1,"d":"1.000"}},"(7.5)"]
["basic design press","p","KPa",{"$f":"'basic design pressure 8'!G43","v":{"v":1,"d":"1.00"}},"(7.4)",null,"see work sheet \"basic design press\""]
["allowable flexural stress","Sigma a","MPa",{"$f":"D18/D20","v":{"$error":"#N/A"}},"(7.8)",null,"is actual plate a sandwich?",null,{"$f":"'Worksheet 8'!I23","v":0},null,null,{"$f":"IF(I26=\"YES\",\"the difference in thickness between any two glass plies must be less than or equal to 2 mm and the thickness of the plastic interlayer must be less than, or equal to 0,76 mm for these conditions !\",\"\")","v":""}]
["curvature coefficient","kc",null,{"$f":"IF(D5=\"C\",1-(D9/D8),1-(D9/D7))","v":{"$error":"#DIV/0!"}},"(7.6)",null,{"$f":"IF(I26=\"yes\", \"number of layers?\",\"\")","v":""},null,{"$f":"IF('Worksheet 8'!I24=\"\",\"\",'Worksheet 8'!I24)","v":0}]
["              a/b real  (valid ≤ 5)",null,null,{"$f":"IF(D5=\"C\",1,D6/D7)","v":{"$error":"#DIV/0!"}},"(7.3) Annex G.2"]
["              a/b corrected",null,null,{"$f":"IF(D28>5,5,D28)","v":{"$error":"#DIV/0!"}},"(7.3) Annex G.2"]
["plate aspect ratio coeff stress","kr",null,{"$f":"IF(D5=\"R\",IF(D10=\"SF\",(0.62165*D29^2-0.6473*D29+0.26481)/(D29^2-1.173*D29+0.97671),IF(D10=\"SS\",(0.69952*D29^2+0.02662*D29-0.0735)/(D29^2-0.7185*D29+1.98925),\"Fehler\")),IF(D5=\"C\",IF(D10=\"SF\",0.248,0.309),\"FALSCH\"))","v":"FALSCH"},"(7.3) Annex G.2",null,"actual plate Thickness",null,{"$f":"'Worksheet 8'!I25","v":0},"mm",null,{"$f":"IF(I26=\"yes\", \"=sum of all plies\",\"\")","v":""}]
["pate aspect ratio coeff deflection","kf",null,{"$f":"IF(D5=\"R\",IF(D10=\"SF\",(0.08052*D29^2-0.0272*D29-0.0019)/(D29^2-0.9275*D29+1.70018),IF(D10=\"SS\",(0.12915*D29^2+0.00868*D29-0.0293)/(D29^2-0.887*D29+2.3372),\"Fehler\")),IF(D5=\"C\",IF(D10=\"SF\",0.027,0.043)))","v":false},"(7.3) Annex G.2",null,"required plate thickness",null,{"$f":"IF(AND(I26=\"Yes\",I27=\"\"),\"please enter number of layers\",IF(AND(I26=\"Yes\",I27>2),1.5*MAX(D35:D37),IF(AND(I26=\"Yes\",I27=2),1.2*MAX(D35:D37),IF(I36=\"Yes\",MAX(D36:D37),MAX(D35:D37)))))","v":{"$error":"#DIV/0!"}}]
[{"$nulls":6},"requirements fulfilled?",null,{"$f":"IF(I30=\"\",\"\",IF(I30>=I31,\"PASS\",\"FAIL\"))","v":{"$error":"#DIV/0!"}}]
["Thickness (Stress)","tr","mm",{"$f":"IF(D5=\"C\",D8*D27*SQRT(D30*D24*D25/D26/1000),D7*D27*SQRT(D30*D24*D25/D26/1000))","v":{"$error":"#DIV/0!"}},"(7.1.1)"]
["Thickness (Deflection)","tf","mm",{"$f":"0.45*(D33+D7*D27*POWER((D31*D24*D25/0.02/D19/1000),0.33333))","v":{"$error":"#DIV/0!"}},"(7.1.2)"]
["Thickness",null,null,{"$f":"ROUND(MAX(D33:D34),2)","v":{"$error":"#DIV/0!"}},"(7.1.7)",{"$nulls":3},"Minimum tech used???"]
["Thickness minimu, techn. ",null,"mm",{"$f":"D35-0.5","v":{"$error":"#DIV/0!"}},null,null," = Minimum, absolute",null,{"$f":"Summary!P16","v":0}]
["Thickness minimum, Tab 5","tm","mm",{"$f":"'basic design pressure 8'!J48","v":{"v":0,"d":"0.0"}},"(Tab. 5)",null,"(only PMMA, PC, TG, LG)"]
[]
["Escape Hatch possible ?"]
["Required ISO 9094-1, 2"]
["Circular: inner Diam > 450 mm",null,null,{"$f":"IF(D5=\"C\",IF(D8>450,\"pass\",\"fail\"),\"n.a.\")","v":"n.a."}]
["Rectang: inner Diam > 380 mm",null,null,{"$f":"IF(D5=\"R\",IF(MAX(D6:D7)>380,\"pass\",\"fail\"),\"n.a.\")","v":"n.a."}]
["              Area > 180000 mm²",null,null,{"$f":"IF(D5=\"R\",IF(D6*D7>180000,\"pass\",\"fail\"),\"n.a.\")","v":"n.a."}]

{"sheet":"basic design pressure 8","index":27,"n_rows":193,"n_cols":10,"rows_kept":193,"hidden":true}
["Basic design pressure",null,null,"(7.4 Table 4)"]
[]
["location",null,{"$f":"'main Side windows 8'!D11","v":0}]
["particular",null,{"$f":"IF(AND(C5=\"C\",C6=\"M\",C3=\"III\"),\"A\",'main Side windows 8'!D12)","v":""},null,"Remark: f=front, s=side"]
["design cat",null,{"$f":"'main Side windows 8'!D13","v":0}]
["craft type",null,{"$f":"'main Side windows 8'!D14","v":""},{"$f":"IF(C6=\"Any\",\"S\",C6)","v":""},"Remark: if craft type = Any, set craft type = S"]
[]
[]
["Tabelle 4",null,"location","craft type","design cat","particular","pressure"]
[null,null,"I","Any","Any","Any",70]
[null,null,"IIB","Any","A","Any",70]
[null,null,"IIB","Any","B","Any",50]
[null,null,"IIB","Any","C","Any",28]
[null,null,"IIB","Any","D","Any",28]
[null,null,"IIA","Any","Any","Any",28]
[null,null,"III","S","A","Any",18]
[null,null,"III","S","B","Any",18]
[null,null,"III","S","C","Any",12]
[null,null,"III","S","D","Any",12]
[null,null,"III","M","A","Front",12]
[null,null,"III","M","A","Any",12]
[null,null,"III","M","B","Front",9]
[null,null,"III","M","B","Any",9]
[null,null,"III","M","D","Front",6,null,null,"Korrektur, Zeile eingefügt um Fehler bei eingabe III, M, Front, D zu beheben"]
[null,null,"III","M","A","Side",9]
[null,null,"III","M","B","Side",6]
[null,null,"III","M","C","Any",6]
[null,null,"III","M","D","Any",6]
[null,null,"IV","S","Any","Any",12]
[null,null,"IV","M","Any","Any",6]
[]
["Ergebnis"]
[null,"location = I",{"$nulls":4},{"$f":"IF(C3=\"I\",G10,0)","v":0}]
[null,"location = IIB",{"$nulls":4},{"$f":"IF(C3=\"IIB\",VLOOKUP(C5,E11:G15,3),0)","v":0}]
[null,"location = IIA",{"$nulls":4},{"$f":"IF(C3=\"IIA\",VLOOKUP(C3,E11:G15,3),0)","v":0}]
[null,"location = III","craft = S",{"$nulls":3},{"$f":"IF(AND(C3=\"III\",D6=\"S\"),VLOOKUP(C5,E16:G19,3),0)","v":0}]
[null,"location = III","craft = M","particular = front",null,null,{"$f":"IF(AND(C3=\"III\",D6=\"M\",C4=\"F\"),VLOOKUP(C5,E20:G24,3),0)","v":0}]
[null,"location = III","craft = M","particular = any",null,null,{"$f":"IF(AND(OR(C5=\"A\",C5=\"B\"),C3=\"III\",D6=\"M\",C4=\"A\"),VLOOKUP(C5,E20:G24,3),0)","v":0}]
[null,"location = III","craft = M","particular = side",null,null,{"$f":"IF(AND(C3=\"III\",C6=\"M\",C4=\"S\"),IF(C5=\"A\",9,IF(C5=\"B\",6,0)))","v":false}]
[null,"location = III","craft = M",{"$nulls":3},{"$f":"IF(C5=\"A\",0,IF(C5=\"B\",0,IF(AND(C3=\"III\",C6=\"M\"),VLOOKUP(C5,E27:G28,3))))","v":false}]
[null,"location = IV",{"$nulls":4},{"$f":"IF(C3=\"IV\",VLOOKUP(D6,D29:G30,4,0),1)","v":1}]
[]
["pressure",{"$nulls":5},{"$f":"MAX(G33:G41)","v":1}]
[]
[]
["minimum thickness"]
[]
[null,"Area",{"$f":"IF(OR('main Side windows 8'!D11=\"IIA\",'main Side windows 8'!D11=\"IIB\"),\"II\",'main Side windows 8'!D11)","v":0},{"$nulls":4},"minimum thickness",null,{"$f":"MAX(J50:J190)","v":0}]
[]
[null,null,"PMMA","A","I",{"$f":" IF('main Side windows 8'!$D$15>0,6 + 0.1*('main Side windows 8'!$D$15-4),\"\")","v":""},{"$nulls":3},{"$f":"IF('main Side windows 8'!$D$17=\"PMMA\",(IF('main Side windows 8'!$D$13=\"A\",VLOOKUP($C$48,$E$50:$F$53,2,-1),0)),0)","v":0}]
["Table 5",{"$nulls":3},"II",6]
[{"$nulls":4},"III",5]
[{"$nulls":4},"IV",5]
[null,null,"PMMA","B","I",{"$f":" IF('main Side windows 8'!$D$15>0,6 + 0.1*('main Side windows 8'!$D$15-4),\"\")","v":""},{"$nulls":3},{"$f":"IF('main Side windows 8'!$D$17=\"PMMA\",(IF('main Side windows 8'!$D$13=\"B\",VLOOKUP($C$48,$E$54:$F$57,2,-1),0)),0)","v":0}]
[{"$nulls":4},"II",6]
[{"$nulls":4},"III",5]
[{"$nulls":4},"IV",5]
[null,null,"PMMA","C","I",{"$f":" IF('main Side windows 8'!$D$15>0,6 + 0.1*('main Side windows 8'!$D$15-4),\"\")","v":""},{"$nulls":3},{"$f":"IF('main Side windows 8'!$D$17=\"PMMA\",(IF('main Side windows 8'!$D$13=\"C\",VLOOKUP($C$48,$E$58:$F$61,2,-1),0)),0)","v":0}]
[{"$nulls":4},"II",6]
[{"$nulls":4},"III",4]
[{"$nulls":4},"IV",4]
[null,null,"PMMA","D","I",{"$f":" IF('main Side windows 8'!$D$15>0,6 + 0.1*('main Side windows 8'!$D$15-4),\"\")","v":""},{"$nulls":3},{"$f":"IF('main Side windows 8'!$D$17=\"PMMA\",(IF('main Side windows 8'!$D$13=\"D\",VLOOKUP($C$48,E62:F65,2,-1),0)),0)","v":0}]
[{"$nulls":4},"II",6]
[{"$nulls":4},"III",4]
[{"$nulls":4},"IV",4]
[null,null,"PC","A","I",{"$f":" IF('main Side windows 8'!$D$15>0,6 + 0.1*('main Side windows 8'!$D$15-4),\"\")","v":""},{"$nulls":3},{"$f":"IF('main Side windows 8'!$D$17=\"PC\",(IF('main Side windows 8'!$D$13=\"A\",VLOOKUP($C$48,E66:F69,2,-1),0)),0)","v":0}]
[{"$nulls":4},"II",6]
[{"$nulls":4},"III",5]
[{"$nulls":4},"IV",5]
[null,null,"PC","B","I",{"$f":" IF('main Side windows 8'!$D$15>0,6 + 0.1*('main Side windows 8'!$D$15-4),\"\")","v":""},{"$nulls":3},{"$f":"IF('main Side windows 8'!$D$17=\"PC\",(IF('main Side windows 8'!$D$13=\"B\",VLOOKUP($C$48,E70:F73,2,-1),0)),0)","v":0}]
[{"$nulls":4},"II",6]
[{"$nulls":4},"III",5]
[{"$nulls":4},"IV",5]
[null,null,"PC","C","I",{"$f":" IF('main Side windows 8'!$D$15>0,6 + 0.1*('main Side windows 8'!$D$15-4),\"\")","v":""},{"$nulls":3},{"$f":"IF('main Side windows 8'!$D$17=\"PC\",(IF('main Side windows 8'!$D$13=\"C\",VLOOKUP($C$48,E74:F77,2,-1),0)),0)","v":0}]
[{"$nulls":4},"II",6]
[{"$nulls":4},"III",4]
[{"$nulls":4},"IV",4]
[null,null,"PC","D","I",{"$f":" IF('main Side windows 8'!$D$15>0,6 + 0.1*('main Side windows 8'!$D$15-4),\"\")","v":""},{"$nulls":3},{"$f":"IF('main Side windows 8'!$D$17=\"PC\",(IF('main Side windows 8'!$D$13=\"D\",VLOOKUP($C$48,E78:F81,2,-1),0)),0)","v":0}]
[{"$nulls":4},"II",6]
[{"$nulls":4},"III",4]
[{"$nulls":4},"IV",4]
[null,null,"TG","A","I",{"$f":" IF('main Side windows 8'!$D$15>0,5+ 0.1*('main Side windows 8'!$D$15-4),\"\")","v":""},{"$nulls":3},{"$f":"IF('main Side windows 8'!$D$17=\"TG\",(IF('main Side windows 8'!$D$13=\"A\",VLOOKUP($C$48,E82:F85,2,-1),0)),0)","v":0}]
[{"$nulls":4},"II",4]
[{"$nulls":4},"III",4]
[{"$nulls":4},"IV",4]
[null,null,"TG","B","I",{"$f":" IF('main Side windows 8'!$D$15>0,5+ 0.1*('main Side windows 8'!$D$15-4),\"\")","v":""},{"$nulls":3},{"$f":"IF('main Side windows 8'!$D$17=\"TG\",(IF('main Side windows 8'!$D$13=\"B\",VLOOKUP($C$48,E86:F89,2,-1),0)),0)","v":0}]
[{"$nulls":4},"II",4]
[{"$nulls":4},"III",4]
[{"$nulls":4},"IV",4]
[null,null,"TG","C","I",{"$f":" IF('main Side windows 8'!$D$15>0,5+ 0.1*('main Side windows 8'!$D$15-4),\"\")","v":""},{"$nulls":3},{"$f":"IF('main Side windows 8'!$D$17=\"TG\",(IF('main Side windows 8'!$D$13=\"C\",VLOOKUP($C$48,E90:F93,2,-1),0)),0)","v":0}]
[{"$nulls":4},"II",4]
[{"$nulls":4},"III",3]
[{"$nulls":4},"IV",3]
[null,null,"TG","D","I",{"$f":" IF('main Side windows 8'!$D$15>0,5+ 0.1*('main Side windows 8'!$D$15-4),\"\")","v":""},{"$nulls":3},{"$f":"IF('main Side windows 8'!$D$17=\"TG\",(IF('main Side windows 8'!$D$13=\"D\",VLOOKUP($C$48,E94:F97,2,-1),0)),0)","v":0}]
[{"$nulls":4},"II",4]
[{"$nulls":4},"III",3]
[{"$nulls":4},"IV",3]
[null,null,"LG","A","I",{"$f":" IF('main Side windows 8'!$D$15>0,5+ 0.1*('main Side windows 8'!$D$15-4),\"\")","v":""},{"$nulls":3},{"$f":"IF('main Side windows 8'!$D$17=\"LG\",(IF('main Side windows 8'!$D$13=\"A\",VLOOKUP($C$48,E98:F101,2,-1),0)),0)","v":0}]
[{"$nulls":4},"II",4]
[{"$nulls":4},"III",4]
[{"$nulls":4},"IV",4]
[null,null,"LG","B","I",{"$f":" IF('main Side windows 8'!$D$15>0,5+ 0.1*('main Side windows 8'!$D$15-4),\"\")","v":""},{"$nulls":3},{"$f":"IF('main Side windows 8'!$D$17=\"LG\",(IF('main Side windows 8'!$D$13=\"B\",VLOOKUP($C$48,E102:F105,2,-1),0)),0)","v":0}]
[{"$nulls":4},"II",4]
[{"$nulls":4},"III",4]
[{"$nulls":4},"IV",4]
[null,null,"LG","C","I",{"$f":" IF('main Side windows 8'!$D$15>0,5+ 0.1*('main Side windows 8'!$D$15-4),\"\")","v":""},{"$nulls":3},{"$f":"IF('main Side windows 8'!$D$17=\"LG\",(IF('main Side windows 8'!$D$13=\"C\",VLOOKUP($C$48,E106:F109,2,-1),0)),0)","v":0}]
[{"$nulls":4},"II",4]
[{"$nulls":4},"III",3]
[{"$nulls":4},"IV",3]
[null,null,"LG","D","I",{"$f":" IF('main Side windows 8'!$D$15>0,5+ 0.1*('main Side windows 8'!$D$15-4),\"\")","v":""},{"$nulls":3},{"$f":"IF('main Side windows 8'!$D$17=\"LG\",(IF('main Side windows 8'!$D$13=\"D\",VLOOKUP($C$48,E110:F113,2,-1),0)),0)","v":0}]
[{"$nulls":4},"II",4]
[{"$nulls":4},"III",3]
[{"$nulls":4},"IV",3]
[null,null,"AMPW","A","I",{"$f":" IF('main Side windows 8'!$D$15>0,8+ 0.1*('main Side windows 8'!$D$15-4),\"\")","v":""},{"$nulls":3},{"$f":"IF('main Side windows 8'!$D$17=\"AMPW\",(IF('main Side windows 8'!$D$13=\"A\",VLOOKUP($C$48,E114:F117,2,-1),0)),0)","v":0}]
[{"$nulls":4},"II",6]
[{"$nulls":4},"III",5]
[{"$nulls":4},"IV",5]
[null,null,"AMPW","B","I",{"$f":" IF('main Side windows 8'!$D$15>0,8+ 0.1*('main Side windows 8'!$D$15-4),\"\")","v":""},{"$nulls":3},{"$f":"IF('main Side windows 8'!$D$17=\"AMPW\",(IF('main Side windows 8'!$D$13=\"B\",VLOOKUP($C$48,E118:F121,2,-1),0)),0)","v":0}]
[{"$nulls":4},"II",6]
[{"$nulls":4},"III",5]
[{"$nulls":4},"IV",5]
[null,null,"AMPW","C","I",{"$f":" IF('main Side windows 8'!$D$15>0,8+ 0.1*('main Side windows 8'!$D$15-4),\"\")","v":""},{"$nulls":3},{"$f":"IF('main Side windows 8'!$D$17=\"AMPW\",(IF('main Side windows 8'!$D$13=\"C\",VLOOKUP($C$48,E122:F125,2,-1),0)),0)","v":0}]
[{"$nulls":4},"II",6]
[{"$nulls":4},"III",4]
[{"$nulls":4},"IV",4]
[null,null,"AMPW","D","I",{"$f":" IF('main Side windows 8'!$D$15>0,8+ 0.1*('main Side windows 8'!$D$15-4),\"\")","v":""},{"$nulls":3},{"$f":"IF('main Side windows 8'!$D$17=\"AMPW\",(IF('main Side windows 8'!$D$13=\"D\",VLOOKUP($C$48,E126:F129,2,-1),0)),0)","v":0}]
[{"$nulls":4},"II",6]
[{"$nulls":4},"III",4]
[{"$nulls":4},"IV",4]
[null,null,"GRP m30","A","I",{"$f":" IF('main Side windows 8'!$D$15>0,4 + 0.1*('main Side windows 8'!$D$15-4),\"\")","v":""},{"$nulls":3},{"$f":"IF('main Side windows 8'!$D$17=\"GRP M30\",(IF('main Side windows 8'!$D$13=\"A\",VLOOKUP($C$48,E130:F133,2,-1),0)),0)","v":0}]
[{"$nulls":4},"II",3]
[{"$nulls":4},"III",3]
[{"$nulls":4},"IV",3]
[null,null,"GRP m30","B","I",{"$f":" IF('main Side windows 8'!$D$15>0,4 + 0.1*('main Side windows 8'!$D$15-4),\"\")","v":""},{"$nulls":3},{"$f":"IF('main Side windows 8'!$D$17=\"GRP M30\",(IF('main Side windows 8'!$D$13=\"B\",VLOOKUP($C$48,E134:F137,2,-1),0)),0)","v":0}]
[{"$nulls":4},"II",3]
[{"$nulls":4},"III",3]
[{"$nulls":4},"IV",3]
[null,null,"GRP m30","C","I",{"$f":" IF('main Side windows 8'!$D$15>0,4 + 0.1*('main Side windows 8'!$D$15-4),\"\")","v":""},{"$nulls":3},{"$f":"IF('main Side windows 8'!$D$17=\"GRP M30\",(IF('main Side windows 8'!$D$13=\"C\",VLOOKUP($C$48,E138:F141,2,-1),0)),0)","v":0}]
[{"$nulls":4},"II",3]
[{"$nulls":4},"III",2]
[{"$nulls":4},"IV",2]
[null,null,"GRP m30","D","I",{"$f":" IF('main Side windows 8'!$D$15>0,4 + 0.1*('main Side windows 8'!$D$15-4),\"\")","v":""},{"$nulls":3},{"$f":"IF('main Side windows 8'!$D$17=\"GRP M30\",(IF('main Side windows 8'!$D$13=\"D\",VLOOKUP($C$48,E142:F145,2,-1),0)),0)","v":0}]
[{"$nulls":4},"II",3]
[{"$nulls":4},"III",2]
[{"$nulls":4},"IV",2]
[null,null,"GRP m35","A","I",{"$f":" IF('main Side windows 8'!$D$15>0,4 + 0.1*('main Side windows 8'!$D$15-4),\"\")","v":""},{"$nulls":3},{"$f":"IF('main Side windows 8'!$D$17=\"GRP M35\",(IF('main Side windows 8'!$D$13=\"A\",VLOOKUP($C$48,E146:F149,2,-1),0)),0)","v":0}]
[{"$nulls":4},"II",3]
[{"$nulls":4},"III",3]
[{"$nulls":4},"IV",3]
[null,null,"GRP m35","B","I",{"$f":" IF('main Side windows 8'!$D$15>0,4 + 0.1*('main Side windows 8'!$D$15-4),\"\")","v":""},{"$nulls":3},{"$f":"IF('main Side windows 8'!$D$17=\"GRP M35\",(IF('main Side windows 8'!$D$13=\"B\",VLOOKUP($C$48,E150:F153,2,-1),0)),0)","v":0}]
[{"$nulls":4},"II",3]
[{"$nulls":4},"III",3]
[{"$nulls":4},"IV",3]
[null,null,"GRP m35","C","I",{"$f":" IF('main Side windows 8'!$D$15>0,4 + 0.1*('main Side windows 8'!$D$15-4),\"\")","v":""},{"$nulls":3},{"$f":"IF('main Side windows 8'!$D$17=\"GRP M35\",(IF('main Side windows 8'!$D$13=\"C\",VLOOKUP($C$48,E154:F157,2,-1),0)),0)","v":0}]
[{"$nulls":4},"II",3]
[{"$nulls":4},"III",2]
[{"$nulls":4},"IV",2]
[null,null,"GRP m35","D","I",{"$f":" IF('main Side windows 8'!$D$15>0,4 + 0.1*('main Side windows 8'!$D$15-4),\"\")","v":""},{"$nulls":3},{"$f":"IF('main Side windows 8'!$D$17=\"GRP M35\",(IF('main Side windows 8'!$D$13=\"D\",VLOOKUP($C$48,E158:F161,2,-1),0)),0)","v":0}]
[{"$nulls":4},"II",3]
[{"$nulls":4},"III",2]
[{"$nulls":4},"IV",2]
[null,null,"Al 5038","A","I",{"$f":" IF('main Side windows 8'!$D$15>0,3 + 0.05*('main Side windows 8'!$D$15-4),\"\")","v":""},{"$nulls":3},{"$f":"IF('main Side windows 8'!$D$17=\"Al 5038\",(IF('main Side windows 8'!$D$13=\"A\",VLOOKUP($C$48,E162:F165,2,-1),0)),0)","v":0}]
[{"$nulls":4},"II",3]
[{"$nulls":4},"III",3]
[{"$nulls":4},"IV",3]
[null,null,"Al 5038","B","I",{"$f":" IF('main Side windows 8'!$D$15>0,3 + 0.05*('main Side windows 8'!$D$15-4),\"\")","v":""},{"$nulls":3},{"$f":"IF('main Side windows 8'!$D$17=\"AL 5038\",(IF('main Side windows 8'!$D$13=\"B\",VLOOKUP($C$48,E166:F169,2,-1),0)),0)","v":0}]
[{"$nulls":4},"II",3]
[{"$nulls":4},"III",3]
[{"$nulls":4},"IV",3]
[null,null,"Al 5038","C","I",{"$f":" IF('main Side windows 8'!$D$15>0,3 + 0.05*('main Side windows 8'!$D$15-4),\"\")","v":""},{"$nulls":3},{"$f":"IF('main Side windows 8'!$D$17=\"AL 5038\",(IF('main Side windows 8'!$D$13=\"C\",VLOOKUP($C$48,E170:F173,2,-1),0)),0)","v":0}]
[{"$nulls":4},"II",3]
[{"$nulls":4},"III",2]
[{"$nulls":4},"IV",2]
[null,null,"Al 5038","D","I",{"$f":" IF('main Side windows 8'!$D$15>0,3 + 0.05*('main Side windows 8'!$D$15-4),\"\")","v":""},{"$nulls":3},{"$f":"IF('main Side windows 8'!$D$17=\"AL 5038\",(IF('main Side windows 8'!$D$13=\"D\",VLOOKUP($C$48,E174:F177,2,-1),0)),0)","v":0}]
[{"$nulls":4},"II",3]
[{"$nulls":4},"III",2]
[{"$nulls":4},"IV",2]
[null,null,"MS","A","I",{"$f":" IF('main Side windows 8'!$D$15>0,2.5 + 0.025*('main Side windows 8'!$D$15-4),\"\")","v":""},{"$nulls":3},{"$f":"IF('main Side windows 8'!$D$17=\"MS\",(IF('main Side windows 8'!$D$13=\"A\",VLOOKUP($C$48,E178:F181,2,-1),0)),0)","v":0}]
[{"$nulls":4},"II",2.5]
[{"$nulls":4},"III",2.5]
[{"$nulls":4},"IV",2.5]
[null,null,"MS","B","I",{"$f":" IF('main Side windows 8'!$D$15>0,2.5 + 0.025*('main Side windows 8'!$D$15-4),\"\")","v":""},{"$nulls":3},{"$f":"IF('main Side windows 8'!$D$17=\"MS\",(IF('main Side windows 8'!$D$13=\"B\",VLOOKUP($C$48,E182:F185,2,-1),0)),0)","v":0}]
[{"$nulls":4},"II",2.5]
[{"$nulls":4},"III",2.5]
[{"$nulls":4},"IV",2.5]
[null,null,"MS","C","I",{"$f":" IF('main Side windows 8'!$D$15>0,2.5 + 0.025*('main Side windows 8'!$D$15-4),\"\")","v":""},{"$nulls":3},{"$f":"IF('main Side windows 8'!$D$17=\"MS\",(IF('main Side windows 8'!$D$13=\"C\",VLOOKUP($C$48,E186:F189,2,-1),0)),0)","v":0}]
[{"$nulls":4},"II",2.5]
[{"$nulls":4},"III",2]
[{"$nulls":4},"IV",2]
[null,null,"MS","D","I",{"$f":" IF('main Side windows 8'!$D$15>0,2.5 + 0.025*('main Side windows 8'!$D$15-4),\"\")","v":""},{"$nulls":3},{"$f":"IF('main Side windows 8'!$D$17=\"MS\",(IF('main Side windows 8'!$D$13=\"D\",VLOOKUP($C$48,E190:F193,2,-1),0)),0)","v":0}]
[{"$nulls":4},"II",2.5]
[{"$nulls":4},"III",2]
[{"$nulls":4},"IV",2]

{"sheet":"Worksheet 9","index":28,"n_rows":45,"n_cols":31,"rows_kept":45,"merged":[[0,0,0,9],[0,11,0,12],[1,0,1,9],[2,0,2,9],[4,0,4,9],[6,0,6,5],[17,13,17,14],[19,13,19,14],[21,12,21,14],[22,15,26,18],[27,6,28,6],[27,7,28,7],[27,15,27,21],[29,15,32,15],[29,16,32,16],[29,17,32,17],[29,18,29,21],[30,18,30,21],[31,18,31,19],[32,11,32,13],[34,13,34,14],[36,13,36,14],[38,13,38,14],[39,13,39,14],[41,13,41,14]]}
[{"$nulls":11},"Comments"]
["ISO 12216:2020 - Small craft - Windows, portlights, hatches, deadlights and doors",{"$nulls":11},"Derived values"]
["WORKSHEET No. 1 data entry",{"$nulls":11},"Input values"]
[]
[{"$f":"CONCATENATE(coverSheet!B5,\"   \",coverSheet!B12,\"   \",Summary!B17)","v":"      "}]
[]
["Parameter",{"$nulls":5},"Symbol","Unit","Value","Ref.",{"$nulls":5},"Material Properties see table F.1 and Tab. 5",{"$nulls":11},"List"]
["Form of plate (Rectangular / Circle)",{"$nulls":5},"R / C",null,{"$f":"Summary!C17","v":0},"Annex C",{"$nulls":5},"Table F.1 mechanical properties [MPa]",null,null,"Tab. 5",{"$nulls":8},"Lists"]
["Long side",{"$nulls":5},"a","mm",{"$f":"Summary!D17","v":0},"7.3, Annex C",{"$nulls":5},"Material","strength","elasticity","safety",{"$nulls":7},"rectangular","R","I","A",{"$f":"IF(I8=\"rectangular\",\"R\",IF(I8=\"circle\",\"C\",\"\"))","v":""}]
["Unsupported short side",{"$nulls":5},"b","mm",{"$f":"Summary!E17","v":0},"7.3, Annex C",{"$nulls":5},"PMMA",110,3000,3.5,{"$nulls":7},"circle","C","IIa","B"]
["Diameter",{"$nulls":5},"d","mm",{"$f":"Summary!F17","v":0},"7.3, Annex C",{"$nulls":5},"PC",90,2400,3.5,{"$nulls":9},"IIb","C"]
["Curve height",{"$nulls":5},"c","mm",{"$f":"Summary!G17","v":0},"7.6",{"$nulls":5},"TG",200,72600,4,{"$nulls":9},"III","D"]
["Support SemiFixed / Simply Supported",{"$nulls":5},"SF / SS",null,{"$f":"Summary!H17","v":0},"3.18",{"$nulls":5},"CG",300,72600,4,{"$nulls":7},"semi-fixed","SF","IV",null,{"$f":"IF(I13=\"semi-fixed\",\"SF\",IF(I13=\"\",\"\",\"SS\"))","v":"SS"}]
["Location type",{"$nulls":5},"I/IIA/IIB/III/IV",null,{"$f":"Summary!I17","v":0},"3.17; Annex A",{"$nulls":5},"AG",40,72600,4,{"$nulls":7},"simply supported","SS"]
["Location area (only loc. III)",{"$nulls":5},"F / S / Any",null,{"$f":"Summary!J17","v":0},"3.17.4",{"$nulls":5},"AMPW",50,7000,2]
["Design Category",{"$nulls":5},"A / B / C / D",null,{"$f":"Summary!K17","v":0},"3.12",{"$nulls":5},"GRP M30",140,7500,2,{"$nulls":6},"any","front","F","Any","yes",{"$f":"IF(I15=\"front\",\"F\",IF(I15=\"side\",\"S\",IF(I15=\"any\",\"A\",\"\")))","v":""}]
["Craft Type Any/Motor/Sail",{"$nulls":5},"Any / M / S",null,{"$f":"Summary!L17","v":0},{"$nulls":6},"GRP M35",175,10000,2,{"$nulls":6},"motor","side","S","M","no"]
["Length of hull as in ISO 8666",{"$nulls":5},"LH","m",{"$f":"Summary!N17","v":{"v":0,"d":"0.00"}},"3.16",{"$nulls":5},"AL 5038",280,70000,2,{"$nulls":6},"sail","any","Any","S",null,{"$f":"IF(I17=\"any\",\"Any\",IF(I17=\"motor\",\"M\",IF(I17=\"sail\",\"S\",\"\")))","v":""}]
["Material data",{"$nulls":7},{"$f":"Summary!O17","v":0},"Table F.1 & 5",{"$nulls":5},"MS",400,200000,2]
[null,"  Ultimate flexural strength",{"$nulls":4},"σU","MPa",{"$f":"'main Side windows 9'!D18","v":{"$error":"#N/A"}},"Table F.1 & 5",{"$nulls":5},"AISI 316 L",510,200000,2]
[null,"  Modulus of elasticity",{"$nulls":4},"E","MPa",{"$f":"'main Side windows 9'!D19","v":{"$error":"#N/A"}},"Table F.1 & 5"]
[null,"  Safety factor",{"$nulls":4},"gamma",". / .",{"$f":"'main Side windows 9'!D20","v":{"$error":"#N/A"}},"Table F.1 & 5",{"$nulls":15},"yes"]
["Is actual plate a sandwich?",{"$nulls":5},"yes / no",null,{"$f":"Summary!Q17","v":0},"7.9",{"$nulls":5},{"$f":"IF(I23=\"YES\",\"The difference in thickness between any two glass plies must be less than or equal to 2 mm and the thickness of the plastic interlayer must be less than, or equal to 0,76 mm for these conditions !\",\"\")","v":""},{"$nulls":9},"no"]
[null,"If yes, enter number of layers",{"$nulls":5},". / .",{"$f":"Summary!R17","v":0},"7.9"]
["Actual plate thickness (in case of sandwich the sum of all layers)",{"$nulls":6},"mm",{"$f":"Summary!U17","v":{"v":0,"d":"0.00"}}]
[]
["Results for non-stiffened plates"]
["Press reduction factor",{"$nulls":5},"Ψ",". / .",{"$f":"'main Side windows 9'!D23","v":false},"7.5"]
["              within limits 0,33 and 1,0",{"$nulls":7},{"$f":"'main Side windows 9'!D24","v":1},"7.5",{"$nulls":5},"Table 5 — Safety factor and minimum thickness of monolithic plates"]
["Basic design press",{"$nulls":5},"p","kPa",{"$f":"'main Side windows 9'!D25","v":1},"7.4",{"$nulls":5},"Material","Acronym","Safety factor\n γ ","Minimum thickness of monolithic plates, tm"]
["Allowable flexural stress",{"$nulls":5},"σa","MPa",{"$f":"'main Side windows 9'!D26","v":{"$error":"#N/A"}},"7.8",{"$nulls":8},"Design categories "]
["Curvature coefficient",{"$nulls":5},"kC",". / .",{"$f":"'main Side windows 9'!D27","v":{"$error":"#DIV/0!"}},"7.6",{"$nulls":8},"Any",null,"A & B","C & D"]
["Ratio a/b (valid ≤ 5)",{"$nulls":6},". / .",{"$f":"'main Side windows 9'!D28","v":{"$error":"#DIV/0!"}},"7.3, Annex G.2",{"$nulls":8},"Area Ia","Area II","Area III & IV","Area III & IV"]
["Ratio a/b corrected",{"$nulls":6},". / .",{"$f":"'main Side windows 9'!D29","v":{"$error":"#DIV/0!"}},"7.3, Annex G.2",{"$nulls":5},"Poly(methyl)methacrylate","PMMA",3.5,"6+0,1(LH-4)",6,5,4]
["Plate aspect ratio coeff stress",{"$nulls":5},"kr",". / .",{"$f":"'main Side windows 9'!D30","v":"FALSCH"},"7.3, Annex G.2",{"$nulls":5},"Polycarbonate","PC",3.5,"6+0,1(LH-4)",6,5,4]
["Pate aspect ratio coeff deflection",{"$nulls":5},"kf",". / .",{"$f":"'main Side windows 9'!D31","v":false},"7.3, Annex G.2",{"$nulls":5},"Monolithic tempered glass ","TG",4,"5+0,1(LH-4)b",4,4,3]
[{"$nulls":15},"Laminated glass ","LG",4,"5+0,1(LH-4)b",4,4,3]
["Thickness (Stress)",{"$nulls":5},"tr","mm",{"$f":"'main Side windows 9'!D33","v":{"$error":"#DIV/0!"}},"7.1.1",{"$nulls":5},"All mahogany plywood ","AMPW",2,"8+0,1(LH-4)",6,5,4]
["Thickness (Deflection)",{"$nulls":5},"tf","mm",{"$f":"'main Side windows 9'!D34","v":{"$error":"#DIV/0!"}},"7.1.2",{"$nulls":5},"GRP mat 30 % glass ","GRP M30",2,"4+0,1(LH-4)",3,3,2]
["Thickness",{"$nulls":6},"mm",{"$f":"'main Side windows 9'!D35","v":{"$error":"#DIV/0!"}},{"$nulls":6},"GRP mat/roving 35 % glass ","GRP M35",2,"4+0,1(LH-4)",3,3,2]
["Thickness minimu, techn. ",{"$nulls":5},"tm","mm",{"$f":"'main Side windows 9'!D36","v":{"$error":"#DIV/0!"}},"7.8",{"$nulls":5},"Aluminium alloy 5083-H111 ","AL 5038",2,"3+0,05 (LH-4)",3,3,2]
["Thickness minimum, Tab 5",{"$nulls":6},"mm",{"$f":"'main Side windows 9'!D37","v":{"v":0,"d":"0.0"}},"Table 5",{"$nulls":5},"Mild steel ","MS",2,"2,5+0,025 (LH-4)",2.5,2.5,2]
[]
["Required plate thickness",{"$nulls":6},"mm",{"$f":"'main Side windows 9'!I31","v":{"$error":"#DIV/0!"}}]
["Requirements fullfilled?",{"$nulls":7},{"$f":"IF(L13=\"short side in area I max 300mm\",\"FAIL\",IF(I25>=I44,\"PASS\",\"FAIL\"))","v":{"$error":"#DIV/0!"}}]

{"sheet":"main Side windows 9","index":29,"n_rows":43,"n_cols":24,"rows_kept":43,"hidden":true,"merged":[[0,0,0,5],[1,0,1,5],[25,11,28,18],[26,6,26,7]]}
[{"$nulls":6},"manufacturer"]
[{"$nulls":6},"model name"]
["Eingabe","Version 1.2.2 / 15-03-2006 rev 060512/070507/dew 090918",{"$nulls":4},"ISO/FDIS 12216:2002(E)"]
["Parameter Input","SSign","Item/Unit",{"$nulls":18},"Lists"]
["form of plate Rectangular/Circle",null,"R/C",{"$f":"'Worksheet 9'!AE9","v":""},{"$f":"IF(D5=\"\",\"Input R oder C\",\"\")","v":"Input R oder C"},null,"Material Properties see table F.1 and Tab. 5",{"$nulls":14},"R","I","A"]
["long side","a","mm",{"$f":"'Worksheet 9'!I9","v":0},{"$f":"IF(AND(D5=\"R\",D6=\"\"),\"Input a requested\",IF(AND(D5=\"C\",D6=\"\"),\"Input d requested\",\"\"))","v":""},null,"Table F.1 mechanical properties [Mpa]",null,null,"Tab. 5",{"$nulls":11},"C","IIa","B"]
["unsupported short side","b","mm",{"$f":"'Worksheet 9'!I10","v":0},{"$f":"IF(AND(D5=\"R\",D7=\"\"),\"Input b requested\",IF(AND(D5=\"C\",D7=\"\"),\"Input d requested\",\"\"))","v":""},null,"Material","strength","elasticity","safety",{"$nulls":12},"IIb","C"]
["diameter","d","mm",{"$f":"'Worksheet 9'!I11","v":0},{"$f":"IF(AND(D5=\"C\",D8=\"\"),\"Input d requested\",\"\")","v":""},null,"PMMA",110,3000,3.5,{"$nulls":3},"AG",40,72600,4,{"$nulls":5},"III","D"]
["curve height","c","mm",{"$f":"'Worksheet 9'!I12","v":0},"optional",null,"PC",90,2400,3.5,{"$nulls":3},"AISI 316 L",510,200000,2,{"$nulls":4},"SF","IV"]
["support SemiFixed/Simple Supp.",null,"SF/SS",{"$f":"'Worksheet 9'!AE13","v":"SS"},{"$f":"IF(D10=\"\",\"Input SF or SS\",\"\")","v":""},null,"TG",200,72600,4,null,null,"6.1","AL 5038",280,70000,2,{"$nulls":4},"SS"]
["Location type",null,"I/IIA/IIB/III/IV",{"$f":"'Worksheet 9'!I14","v":{"v":0,"d":"0.00"}},{"$f":"IF(D11=\"\",\"Input I / IIa,b / III / IV\",\"\")","v":""},null,"CG",300,72600,4,null,null,"3.17.1-4","AMPW",50,7000,2]
["Location area (only loc. III)",null,"F/S/A",{"$f":"'Worksheet 9'!AE16","v":""},{"$f":"IF(D12=\"F\",\"\",IF(D12=\"S\",\"\",IF(D12=\"A\",\"\",IF(D11=\"III\",\"Input F / S / A\",\"\"))))","v":""},null,"AG",40,72600,4,{"$nulls":3},"CG",300,72600,4,{"$nulls":4},"F","Any","yes"]
["Design Category",null,"A/B/C/D",{"$f":"IF('Worksheet 9'!I16=\"\",\"\",'Worksheet 9'!I16)","v":{"v":0,"d":"0.00"}},{"$f":"IF(D13=\"\",\"Input A / B / C / D\",\"\")","v":""},null,"AMPW",50,7000,2,{"$nulls":3},"GRP M30",140,7500,2,{"$nulls":4},"S","M","no"]
["Craft Type Any/Motor/Sail",null,"Any/M/S",{"$f":"'Worksheet 9'!AE18","v":""},{"$f":"IF(D14=\"\",\"Input Any / M / S\",\"\")","v":"Input Any / M / S"},null,"GRP M30",140,7500,2,{"$nulls":3},"GRP M35",175,10000,2,{"$nulls":4},"A","S"]
["optional: craft length of hull",null,"m",{"$f":"'Worksheet 9'!I18","v":{"v":0,"d":"0.00"}},"default, change if smaller",null,"GRP M35",175,10000,2,{"$nulls":3},"MS",400,200000,2]
[{"$nulls":6},"AL 5038",280,70000,2,{"$nulls":3},"PC",90,2400,3.5]
["Material",null,"see Tab. F.1",{"$f":"'Worksheet 9'!I19","v":{"v":0,"d":"0.00"}},{"$f":"IF(D17=\"\",\"manual input requ\",\"\")","v":""},null,"MS",400,200000,2,{"$nulls":3},"PMMA",110,3000,3.5]
["  ultimate flexural strength","Sigma u",null,{"$f":"LOOKUP(D17,N8:N18,O8:O18)","v":{"$error":"#N/A"}},"falls nicht in F.1 ",null,"AISI 316 L",510,200000,2,{"$nulls":3},"TG",200,72600,4]
["  modulus of elasticity","E",null,{"$f":"LOOKUP(D17,N8:N18,P8:P18)","v":{"$error":"#N/A"}},"Werte manuell"]
["  safety factor","gamma",null,{"$f":"LOOKUP(D17,N8:N18,Q8:Q18)","v":{"$error":"#N/A"}},"eintragen"]
[]
["Results for non-stiffened plates"]
["press reduction factor",null,null,{"$f":"IF(D5=\"R\",1.102-0.0004*D7,IF(D5=\"C\",1.102-0.0004*D8))","v":false},"(7.5)"]
["              within limits 0,33 and 1,0","psi",null,{"$f":"IF(D23<0.33,0.33,IF(D23>1,1,D23))","v":{"v":1,"d":"1.000"}},"(7.5)"]
["basic design press","p","KPa",{"$f":"'basic design pressure 9'!G43","v":{"v":1,"d":"1.00"}},"(7.4)",null,"see work sheet \"basic design press\""]
["allowable flexural stress","Sigma a","MPa",{"$f":"D18/D20","v":{"$error":"#N/A"}},"(7.8)",null,"is actual plate a sandwich?",null,{"$f":"'Worksheet 9'!I23","v":0},null,null,{"$f":"IF(I26=\"YES\",\"the difference in thickness between any two glass plies must be less than or equal to 2 mm and the thickness of the plastic interlayer must be less than, or equal to 0,76 mm for these conditions !\",\"\")","v":""}]
["curvature coefficient","kc",null,{"$f":"IF(D5=\"C\",1-(D9/D8),1-(D9/D7))","v":{"$error":"#DIV/0!"}},"(7.6)",null,{"$f":"IF(I26=\"yes\", \"number of layers?\",\"\")","v":""},null,{"$f":"IF('Worksheet 9'!I24=\"\",\"\",'Worksheet 9'!I24)","v":0}]
["              a/b real  (valid ≤ 5)",null,null,{"$f":"IF(D5=\"C\",1,D6/D7)","v":{"$error":"#DIV/0!"}},"(7.3) Annex G.2"]
["              a/b corrected",null,null,{"$f":"IF(D28>5,5,D28)","v":{"$error":"#DIV/0!"}},"(7.3) Annex G.2"]
["plate aspect ratio coeff stress","kr",null,{"$f":"IF(D5=\"R\",IF(D10=\"SF\",(0.62165*D29^2-0.6473*D29+0.26481)/(D29^2-1.173*D29+0.97671),IF(D10=\"SS\",(0.69952*D29^2+0.02662*D29-0.0735)/(D29^2-0.7185*D29+1.98925),\"Fehler\")),IF(D5=\"C\",IF(D10=\"SF\",0.248,0.309),\"FALSCH\"))","v":"FALSCH"},"(7.3) Annex G.2",null,"actual plate Thickness",null,{"$f":"'Worksheet 9'!I25","v":0},"mm",null,{"$f":"IF(I26=\"yes\", \"=sum of all plies\",\"\")","v":""}]
["pate aspect ratio coeff deflection","kf",null,{"$f":"IF(D5=\"R\",IF(D10=\"SF\",(0.08052*D29^2-0.0272*D29-0.0019)/(D29^2-0.9275*D29+1.70018),IF(D10=\"SS\",(0.12915*D29^2+0.00868*D29-0.0293)/(D29^2-0.887*D29+2.3372),\"Fehler\")),IF(D5=\"C\",IF(D10=\"SF\",0.027,0.043)))","v":false},"(7.3) Annex G.2",null,"required plate thickness",null,{"$f":"IF(AND(I26=\"Yes\",I27=\"\"),\"please enter number of layers\",IF(AND(I26=\"Yes\",I27>2),1.5*MAX(D35:D37),IF(AND(I26=\"Yes\",I27=2),1.2*MAX(D35:D37),IF(I36=\"Yes\",MAX(D36:D37),MAX(D35:D37)))))","v":{"$error":"#DIV/0!"}}]
[{"$nulls":6},"requirements fulfilled?",null,{"$f":"IF(I30=\"\",\"\",IF(I30>=I31,\"PASS\",\"FAIL\"))","v":{"$error":"#DIV/0!"}}]
["Thickness (Stress)","tr","mm",{"$f":"IF(D5=\"C\",D8*D27*SQRT(D30*D24*D25/D26/1000),D7*D27*SQRT(D30*D24*D25/D26/1000))","v":{"$error":"#DIV/0!"}},"(7.1.1)"]
["Thickness (Deflection)","tf","mm",{"$f":"0.45*(D33+D7*D27*POWER((D31*D24*D25/0.02/D19/1000),0.33333))","v":{"$error":"#DIV/0!"}},"(7.1.2)"]
["Thickness",null,null,{"$f":"ROUND(MAX(D33:D34),2)","v":{"$error":"#DIV/0!"}},"(7.1.7)",{"$nulls":3},"Minimum tech used???"]
["Thickness minimu, techn. ",null,"mm",{"$f":"D35-0.5","v":{"$error":"#DIV/0!"}},null,null," = Minimum, absolute",null,{"$f":"Summary!P17","v":0}]
["Thickness minimum, Tab 5","tm","mm",{"$f":"'basic design pressure 9'!J48","v":{"v":0,"d":"0.0"}},"(Tab. 5)",null,"(only PMMA, PC, TG, LG)"]
[]
["Escape Hatch possible ?"]
["Required ISO 9094-1, 2"]
["Circular: inner Diam > 450 mm",null,null,{"$f":"IF(D5=\"C\",IF(D8>450,\"pass\",\"fail\"),\"n.a.\")","v":"n.a."}]
["Rectang: inner Diam > 380 mm",null,null,{"$f":"IF(D5=\"R\",IF(MAX(D6:D7)>380,\"pass\",\"fail\"),\"n.a.\")","v":"n.a."}]
["              Area > 180000 mm²",null,null,{"$f":"IF(D5=\"R\",IF(D6*D7>180000,\"pass\",\"fail\"),\"n.a.\")","v":"n.a."}]

{"sheet":"basic design pressure 9","index":30,"n_rows":193,"n_cols":10,"rows_kept":193,"hidden":true}
["Basic design pressure",null,null,"(7.4 Table 4)"]
[]
["location",null,{"$f":"'main Side windows 9'!D11","v":0}]
["particular",null,{"$f":"IF(AND(C5=\"C\",C6=\"M\",C3=\"III\"),\"A\",'main Side windows 9'!D12)","v":""},null,"Remark: f=front, s=side"]
["design cat",null,{"$f":"'main Side windows 9'!D13","v":0}]
["craft type",null,{"$f":"'main Side windows 9'!D14","v":""},{"$f":"IF(C6=\"Any\",\"S\",C6)","v":""},"Remark: if craft type = Any, set craft type = S"]
[]
[]
["Tabelle 4",null,"location","craft type","design cat","particular","pressure"]
[null,null,"I","Any","Any","Any",70]
[null,null,"IIB","Any","A","Any",70]
[null,null,"IIB","Any","B","Any",50]
[null,null,"IIB","Any","C","Any",28]
[null,null,"IIB","Any","D","Any",28]
[null,null,"IIA","Any","Any","Any",28]
[null,null,"III","S","A","Any",18]
[null,null,"III","S","B","Any",18]
[null,null,"III","S","C","Any",12]
[null,null,"III","S","D","Any",12]
[null,null,"III","M","A","Front",12]
[null,null,"III","M","A","Any",12]
[null,null,"III","M","B","Front",9]
[null,null,"III","M","B","Any",9]
[null,null,"III","M","D","Front",6,null,null,"Korrektur, Zeile eingefügt um Fehler bei eingabe III, M, Front, D zu beheben"]
[null,null,"III","M","A","Side",9]
[null,null,"III","M","B","Side",6]
[null,null,"III","M","C","Any",6]
[null,null,"III","M","D","Any",6]
[null,null,"IV","S","Any","Any",12]
[null,null,"IV","M","Any","Any",6]
[]
["Ergebnis"]
[null,"location = I",{"$nulls":4},{"$f":"IF(C3=\"I\",G10,0)","v":0}]
[null,"location = IIB",{"$nulls":4},{"$f":"IF(C3=\"IIB\",VLOOKUP(C5,E11:G15,3),0)","v":0}]
[null,"location = IIA",{"$nulls":4},{"$f":"IF(C3=\"IIA\",VLOOKUP(C3,E11:G15,3),0)","v":0}]
[null,"location = III","craft = S",{"$nulls":3},{"$f":"IF(AND(C3=\"III\",D6=\"S\"),VLOOKUP(C5,E16:G19,3),0)","v":0}]
[null,"location = III","craft = M","particular = front",null,null,{"$f":"IF(AND(C3=\"III\",D6=\"M\",C4=\"F\"),VLOOKUP(C5,E20:G24,3),0)","v":0}]
[null,"location = III","craft = M","particular = any",null,null,{"$f":"IF(AND(OR(C5=\"A\",C5=\"B\"),C3=\"III\",D6=\"M\",C4=\"A\"),VLOOKUP(C5,E20:G24,3),0)","v":0}]
[null,"location = III","craft = M","particular = side",null,null,{"$f":"IF(AND(C3=\"III\",C6=\"M\",C4=\"S\"),IF(C5=\"A\",9,IF(C5=\"B\",6,0)))","v":false}]
[null,"location = III","craft = M",{"$nulls":3},{"$f":"IF(C5=\"A\",0,IF(C5=\"B\",0,IF(AND(C3=\"III\",C6=\"M\"),VLOOKUP(C5,E27:G28,3))))","v":false}]
[null,"location = IV",{"$nulls":4},{"$f":"IF(C3=\"IV\",VLOOKUP(D6,D29:G30,4,0),1)","v":1}]
[]
["pressure",{"$nulls":5},{"$f":"MAX(G33:G41)","v":1}]
[]
[]
["minimum thickness"]
[]
[null,"Area",{"$f":"IF(OR('main Side windows 9'!D11=\"IIA\",'main Side windows 9'!D11=\"IIB\"),\"II\",'main Side windows 9'!D11)","v":0},{"$nulls":4},"minimum thickness",null,{"$f":"MAX(J50:J190)","v":0}]
[]
[null,null,"PMMA","A","I",{"$f":" IF('main Side windows 9'!$D$15>0,6 + 0.1*('main Side windows 9'!$D$15-4),\"\")","v":""},{"$nulls":3},{"$f":"IF('main Side windows 9'!$D$17=\"PMMA\",(IF('main Side windows 9'!$D$13=\"A\",VLOOKUP($C$48,$E$50:$F$53,2,-1),0)),0)","v":0}]
["Table 5",{"$nulls":3},"II",6]
[{"$nulls":4},"III",5]
[{"$nulls":4},"IV",5]
[null,null,"PMMA","B","I",{"$f":" IF('main Side windows 9'!$D$15>0,6 + 0.1*('main Side windows 9'!$D$15-4),\"\")","v":""},{"$nulls":3},{"$f":"IF('main Side windows 9'!$D$17=\"PMMA\",(IF('main Side windows 9'!$D$13=\"B\",VLOOKUP($C$48,$E$54:$F$57,2,-1),0)),0)","v":0}]
[{"$nulls":4},"II",6]
[{"$nulls":4},"III",5]
[{"$nulls":4},"IV",5]
[null,null,"PMMA","C","I",{"$f":" IF('main Side windows 9'!$D$15>0,6 + 0.1*('main Side windows 9'!$D$15-4),\"\")","v":""},{"$nulls":3},{"$f":"IF('main Side windows 9'!$D$17=\"PMMA\",(IF('main Side windows 9'!$D$13=\"C\",VLOOKUP($C$48,$E$58:$F$61,2,-1),0)),0)","v":0}]
[{"$nulls":4},"II",6]
[{"$nulls":4},"III",4]
[{"$nulls":4},"IV",4]
[null,null,"PMMA","D","I",{"$f":" IF('main Side windows 9'!$D$15>0,6 + 0.1*('main Side windows 9'!$D$15-4),\"\")","v":""},{"$nulls":3},{"$f":"IF('main Side windows 9'!$D$17=\"PMMA\",(IF('main Side windows 9'!$D$13=\"D\",VLOOKUP($C$48,E62:F65,2,-1),0)),0)","v":0}]
[{"$nulls":4},"II",6]
[{"$nulls":4},"III",4]
[{"$nulls":4},"IV",4]
[null,null,"PC","A","I",{"$f":" IF('main Side windows 9'!$D$15>0,6 + 0.1*('main Side windows 9'!$D$15-4),\"\")","v":""},{"$nulls":3},{"$f":"IF('main Side windows 9'!$D$17=\"PC\",(IF('main Side windows 9'!$D$13=\"A\",VLOOKUP($C$48,E66:F69,2,-1),0)),0)","v":0}]
[{"$nulls":4},"II",6]
[{"$nulls":4},"III",5]
[{"$nulls":4},"IV",5]
[null,null,"PC","B","I",{"$f":" IF('main Side windows 9'!$D$15>0,6 + 0.1*('main Side windows 9'!$D$15-4),\"\")","v":""},{"$nulls":3},{"$f":"IF('main Side windows 9'!$D$17=\"PC\",(IF('main Side windows 9'!$D$13=\"B\",VLOOKUP($C$48,E70:F73,2,-1),0)),0)","v":0}]
[{"$nulls":4},"II",6]
[{"$nulls":4},"III",5]
[{"$nulls":4},"IV",5]
[null,null,"PC","C","I",{"$f":" IF('main Side windows 9'!$D$15>0,6 + 0.1*('main Side windows 9'!$D$15-4),\"\")","v":""},{"$nulls":3},{"$f":"IF('main Side windows 9'!$D$17=\"PC\",(IF('main Side windows 9'!$D$13=\"C\",VLOOKUP($C$48,E74:F77,2,-1),0)),0)","v":0}]
[{"$nulls":4},"II",6]
[{"$nulls":4},"III",4]
[{"$nulls":4},"IV",4]
[null,null,"PC","D","I",{"$f":" IF('main Side windows 9'!$D$15>0,6 + 0.1*('main Side windows 9'!$D$15-4),\"\")","v":""},{"$nulls":3},{"$f":"IF('main Side windows 9'!$D$17=\"PC\",(IF('main Side windows 9'!$D$13=\"D\",VLOOKUP($C$48,E78:F81,2,-1),0)),0)","v":0}]
[{"$nulls":4},"II",6]
[{"$nulls":4},"III",4]
[{"$nulls":4},"IV",4]
[null,null,"TG","A","I",{"$f":" IF('main Side windows 9'!$D$15>0,5+ 0.1*('main Side windows 9'!$D$15-4),\"\")","v":""},{"$nulls":3},{"$f":"IF('main Side windows 9'!$D$17=\"TG\",(IF('main Side windows 9'!$D$13=\"A\",VLOOKUP($C$48,E82:F85,2,-1),0)),0)","v":0}]
[{"$nulls":4},"II",4]
[{"$nulls":4},"III",4]
[{"$nulls":4},"IV",4]
[null,null,"TG","B","I",{"$f":" IF('main Side windows 9'!$D$15>0,5+ 0.1*('main Side windows 9'!$D$15-4),\"\")","v":""},{"$nulls":3},{"$f":"IF('main Side windows 9'!$D$17=\"TG\",(IF('main Side windows 9'!$D$13=\"B\",VLOOKUP($C$48,E86:F89,2,-1),0)),0)","v":0}]
[{"$nulls":4},"II",4]
[{"$nulls":4},"III",4]
[{"$nulls":4},"IV",4]
[null,null,"TG","C","I",{"$f":" IF('main Side windows 9'!$D$15>0,5+ 0.1*('main Side windows 9'!$D$15-4),\"\")","v":""},{"$nulls":3},{"$f":"IF('main Side windows 9'!$D$17=\"TG\",(IF('main Side windows 9'!$D$13=\"C\",VLOOKUP($C$48,E90:F93,2,-1),0)),0)","v":0}]
[{"$nulls":4},"II",4]
[{"$nulls":4},"III",3]
[{"$nulls":4},"IV",3]
[null,null,"TG","D","I",{"$f":" IF('main Side windows 9'!$D$15>0,5+ 0.1*('main Side windows 9'!$D$15-4),\"\")","v":""},{"$nulls":3},{"$f":"IF('main Side windows 9'!$D$17=\"TG\",(IF('main Side windows 9'!$D$13=\"D\",VLOOKUP($C$48,E94:F97,2,-1),0)),0)","v":0}]
[{"$nulls":4},"II",4]
[{"$nulls":4},"III",3]
[{"$nulls":4},"IV",3]
[null,null,"LG","A","I",{"$f":" IF('main Side windows 9'!$D$15>0,5+ 0.1*('main Side windows 9'!$D$15-4),\"\")","v":""},{"$nulls":3},{"$f":"IF('main Side windows 9'!$D$17=\"LG\",(IF('main Side windows 9'!$D$13=\"A\",VLOOKUP($C$48,E98:F101,2,-1),0)),0)","v":0}]
[{"$nulls":4},"II",4]
[{"$nulls":4},"III",4]
[{"$nulls":4},"IV",4]
[null,null,"LG","B","I",{"$f":" IF('main Side windows 9'!$D$15>0,5+ 0.1*('main Side windows 9'!$D$15-4),\"\")","v":""},{"$nulls":3},{"$f":"IF('main Side windows 9'!$D$17=\"LG\",(IF('main Side windows 9'!$D$13=\"B\",VLOOKUP($C$48,E102:F105,2,-1),0)),0)","v":0}]
[{"$nulls":4},"II",4]
[{"$nulls":4},"III",4]
[{"$nulls":4},"IV",4]
[null,null,"LG","C","I",{"$f":" IF('main Side windows 9'!$D$15>0,5+ 0.1*('main Side windows 9'!$D$15-4),\"\")","v":""},{"$nulls":3},{"$f":"IF('main Side windows 9'!$D$17=\"LG\",(IF('main Side windows 9'!$D$13=\"C\",VLOOKUP($C$48,E106:F109,2,-1),0)),0)","v":0}]
[{"$nulls":4},"II",4]
[{"$nulls":4},"III",3]
[{"$nulls":4},"IV",3]
[null,null,"LG","D","I",{"$f":" IF('main Side windows 9'!$D$15>0,5+ 0.1*('main Side windows 9'!$D$15-4),\"\")","v":""},{"$nulls":3},{"$f":"IF('main Side windows 9'!$D$17=\"LG\",(IF('main Side windows 9'!$D$13=\"D\",VLOOKUP($C$48,E110:F113,2,-1),0)),0)","v":0}]
[{"$nulls":4},"II",4]
[{"$nulls":4},"III",3]
[{"$nulls":4},"IV",3]
[null,null,"AMPW","A","I",{"$f":" IF('main Side windows 9'!$D$15>0,8+ 0.1*('main Side windows 9'!$D$15-4),\"\")","v":""},{"$nulls":3},{"$f":"IF('main Side windows 9'!$D$17=\"AMPW\",(IF('main Side windows 9'!$D$13=\"A\",VLOOKUP($C$48,E114:F117,2,-1),0)),0)","v":0}]
[{"$nulls":4},"II",6]
[{"$nulls":4},"III",5]
[{"$nulls":4},"IV",5]
[null,null,"AMPW","B","I",{"$f":" IF('main Side windows 9'!$D$15>0,8+ 0.1*('main Side windows 9'!$D$15-4),\"\")","v":""},{"$nulls":3},{"$f":"IF('main Side windows 9'!$D$17=\"AMPW\",(IF('main Side windows 9'!$D$13=\"B\",VLOOKUP($C$48,E118:F121,2,-1),0)),0)","v":0}]
[{"$nulls":4},"II",6]
[{"$nulls":4},"III",5]
[{"$nulls":4},"IV",5]
[null,null,"AMPW","C","I",{"$f":" IF('main Side windows 9'!$D$15>0,8+ 0.1*('main Side windows 9'!$D$15-4),\"\")","v":""},{"$nulls":3},{"$f":"IF('main Side windows 9'!$D$17=\"AMPW\",(IF('main Side windows 9'!$D$13=\"C\",VLOOKUP($C$48,E122:F125,2,-1),0)),0)","v":0}]
[{"$nulls":4},"II",6]
[{"$nulls":4},"III",4]
[{"$nulls":4},"IV",4]
[null,null,"AMPW","D","I",{"$f":" IF('main Side windows 9'!$D$15>0,8+ 0.1*('main Side windows 9'!$D$15-4),\"\")","v":""},{"$nulls":3},{"$f":"IF('main Side windows 9'!$D$17=\"AMPW\",(IF('main Side windows 9'!$D$13=\"D\",VLOOKUP($C$48,E126:F129,2,-1),0)),0)","v":0}]
[{"$nulls":4},"II",6]
[{"$nulls":4},"III",4]
[{"$nulls":4},"IV",4]
[null,null,"GRP m30","A","I",{"$f":" IF('main Side windows 9'!$D$15>0,4 + 0.1*('main Side windows 9'!$D$15-4),\"\")","v":""},{"$nulls":3},{"$f":"IF('main Side windows 9'!$D$17=\"GRP M30\",(IF('main Side windows 9'!$D$13=\"A\",VLOOKUP($C$48,E130:F133,2,-1),0)),0)","v":0}]
[{"$nulls":4},"II",3]
[{"$nulls":4},"III",3]
[{"$nulls":4},"IV",3]
[null,null,"GRP m30","B","I",{"$f":" IF('main Side windows 9'!$D$15>0,4 + 0.1*('main Side windows 9'!$D$15-4),\"\")","v":""},{"$nulls":3},{"$f":"IF('main Side windows 9'!$D$17=\"GRP M30\",(IF('main Side windows 9'!$D$13=\"B\",VLOOKUP($C$48,E134:F137,2,-1),0)),0)","v":0}]
[{"$nulls":4},"II",3]
[{"$nulls":4},"III",3]
[{"$nulls":4},"IV",3]
[null,null,"GRP m30","C","I",{"$f":" IF('main Side windows 9'!$D$15>0,4 + 0.1*('main Side windows 9'!$D$15-4),\"\")","v":""},{"$nulls":3},{"$f":"IF('main Side windows 9'!$D$17=\"GRP M30\",(IF('main Side windows 9'!$D$13=\"C\",VLOOKUP($C$48,E138:F141,2,-1),0)),0)","v":0}]
[{"$nulls":4},"II",3]
[{"$nulls":4},"III",2]
[{"$nulls":4},"IV",2]
[null,null,"GRP m30","D","I",{"$f":" IF('main Side windows 9'!$D$15>0,4 + 0.1*('main Side windows 9'!$D$15-4),\"\")","v":""},{"$nulls":3},{"$f":"IF('main Side windows 9'!$D$17=\"GRP M30\",(IF('main Side windows 9'!$D$13=\"D\",VLOOKUP($C$48,E142:F145,2,-1),0)),0)","v":0}]
[{"$nulls":4},"II",3]
[{"$nulls":4},"III",2]
[{"$nulls":4},"IV",2]
[null,null,"GRP m35","A","I",{"$f":" IF('main Side windows 9'!$D$15>0,4 + 0.1*('main Side windows 9'!$D$15-4),\"\")","v":""},{"$nulls":3},{"$f":"IF('main Side windows 9'!$D$17=\"GRP M35\",(IF('main Side windows 9'!$D$13=\"A\",VLOOKUP($C$48,E146:F149,2,-1),0)),0)","v":0}]
[{"$nulls":4},"II",3]
[{"$nulls":4},"III",3]
[{"$nulls":4},"IV",3]
[null,null,"GRP m35","B","I",{"$f":" IF('main Side windows 9'!$D$15>0,4 + 0.1*('main Side windows 9'!$D$15-4),\"\")","v":""},{"$nulls":3},{"$f":"IF('main Side windows 9'!$D$17=\"GRP M35\",(IF('main Side windows 9'!$D$13=\"B\",VLOOKUP($C$48,E150:F153,2,-1),0)),0)","v":0}]
[{"$nulls":4},"II",3]
[{"$nulls":4},"III",3]
[{"$nulls":4},"IV",3]
[null,null,"GRP m35","C","I",{"$f":" IF('main Side windows 9'!$D$15>0,4 + 0.1*('main Side windows 9'!$D$15-4),\"\")","v":""},{"$nulls":3},{"$f":"IF('main Side windows 9'!$D$17=\"GRP M35\",(IF('main Side windows 9'!$D$13=\"C\",VLOOKUP($C$48,E154:F157,2,-1),0)),0)","v":0}]
[{"$nulls":4},"II",3]
[{"$nulls":4},"III",2]
[{"$nulls":4},"IV",2]
[null,null,"GRP m35","D","I",{"$f":" IF('main Side windows 9'!$D$15>0,4 + 0.1*('main Side windows 9'!$D$15-4),\"\")","v":""},{"$nulls":3},{"$f":"IF('main Side windows 9'!$D$17=\"GRP M35\",(IF('main Side windows 9'!$D$13=\"D\",VLOOKUP($C$48,E158:F161,2,-1),0)),0)","v":0}]
[{"$nulls":4},"II",3]
[{"$nulls":4},"III",2]
[{"$nulls":4},"IV",2]
[null,null,"Al 5038","A","I",{"$f":" IF('main Side windows 9'!$D$15>0,3 + 0.05*('main Side windows 9'!$D$15-4),\"\")","v":""},{"$nulls":3},{"$f":"IF('main Side windows 9'!$D$17=\"Al 5038\",(IF('main Side windows 9'!$D$13=\"A\",VLOOKUP($C$48,E162:F165,2,-1),0)),0)","v":0}]
[{"$nulls":4},"II",3]
[{"$nulls":4},"III",3]
[{"$nulls":4},"IV",3]
[null,null,"Al 5038","B","I",{"$f":" IF('main Side windows 9'!$D$15>0,3 + 0.05*('main Side windows 9'!$D$15-4),\"\")","v":""},{"$nulls":3},{"$f":"IF('main Side windows 9'!$D$17=\"AL 5038\",(IF('main Side windows 9'!$D$13=\"B\",VLOOKUP($C$48,E166:F169,2,-1),0)),0)","v":0}]
[{"$nulls":4},"II",3]
[{"$nulls":4},"III",3]
[{"$nulls":4},"IV",3]
[null,null,"Al 5038","C","I",{"$f":" IF('main Side windows 9'!$D$15>0,3 + 0.05*('main Side windows 9'!$D$15-4),\"\")","v":""},{"$nulls":3},{"$f":"IF('main Side windows 9'!$D$17=\"AL 5038\",(IF('main Side windows 9'!$D$13=\"C\",VLOOKUP($C$48,E170:F173,2,-1),0)),0)","v":0}]
[{"$nulls":4},"II",3]
[{"$nulls":4},"III",2]
[{"$nulls":4},"IV",2]
[null,null,"Al 5038","D","I",{"$f":" IF('main Side windows 9'!$D$15>0,3 + 0.05*('main Side windows 9'!$D$15-4),\"\")","v":""},{"$nulls":3},{"$f":"IF('main Side windows 9'!$D$17=\"AL 5038\",(IF('main Side windows 9'!$D$13=\"D\",VLOOKUP($C$48,E174:F177,2,-1),0)),0)","v":0}]
[{"$nulls":4},"II",3]
[{"$nulls":4},"III",2]
[{"$nulls":4},"IV",2]
[null,null,"MS","A","I",{"$f":" IF('main Side windows 9'!$D$15>0,2.5 + 0.025*('main Side windows 9'!$D$15-4),\"\")","v":""},{"$nulls":3},{"$f":"IF('main Side windows 9'!$D$17=\"MS\",(IF('main Side windows 9'!$D$13=\"A\",VLOOKUP($C$48,E178:F181,2,-1),0)),0)","v":0}]
[{"$nulls":4},"II",2.5]
[{"$nulls":4},"III",2.5]
[{"$nulls":4},"IV",2.5]
[null,null,"MS","B","I",{"$f":" IF('main Side windows 9'!$D$15>0,2.5 + 0.025*('main Side windows 9'!$D$15-4),\"\")","v":""},{"$nulls":3},{"$f":"IF('main Side windows 9'!$D$17=\"MS\",(IF('main Side windows 9'!$D$13=\"B\",VLOOKUP($C$48,E182:F185,2,-1),0)),0)","v":0}]
[{"$nulls":4},"II",2.5]
[{"$nulls":4},"III",2.5]
[{"$nulls":4},"IV",2.5]
[null,null,"MS","C","I",{"$f":" IF('main Side windows 9'!$D$15>0,2.5 + 0.025*('main Side windows 9'!$D$15-4),\"\")","v":""},{"$nulls":3},{"$f":"IF('main Side windows 9'!$D$17=\"MS\",(IF('main Side windows 9'!$D$13=\"C\",VLOOKUP($C$48,E186:F189,2,-1),0)),0)","v":0}]
[{"$nulls":4},"II",2.5]
[{"$nulls":4},"III",2]
[{"$nulls":4},"IV",2]
[null,null,"MS","D","I",{"$f":" IF('main Side windows 9'!$D$15>0,2.5 + 0.025*('main Side windows 9'!$D$15-4),\"\")","v":""},{"$nulls":3},{"$f":"IF('main Side windows 9'!$D$17=\"MS\",(IF('main Side windows 9'!$D$13=\"D\",VLOOKUP($C$48,E190:F193,2,-1),0)),0)","v":0}]
[{"$nulls":4},"II",2.5]
[{"$nulls":4},"III",2]
[{"$nulls":4},"IV",2]

{"sheet":"Worksheet 10","index":31,"n_rows":45,"n_cols":31,"rows_kept":45,"merged":[[0,0,0,9],[0,11,0,12],[1,0,1,9],[2,0,2,9],[4,0,4,9],[6,0,6,5],[17,13,17,14],[19,13,19,14],[21,12,21,14],[22,15,26,18],[27,6,28,6],[27,7,28,7],[27,15,27,21],[29,15,32,15],[29,16,32,16],[29,17,32,17],[29,18,29,21],[30,18,30,21],[31,18,31,19],[32,11,32,13],[34,13,34,14],[36,13,36,14],[38,13,38,14],[39,13,39,14],[41,13,41,14]]}
[{"$nulls":11},"Comments"]
["ISO 12216:2020 - Small craft - Windows, portlights, hatches, deadlights and doors",{"$nulls":11},"Derived values"]
["WORKSHEET No. 1 data entry",{"$nulls":11},"Input values"]
[]
[{"$f":"CONCATENATE(coverSheet!B5,\"   \",coverSheet!B12,\"   \",Summary!B18)","v":"      "}]
[]
["Parameter",{"$nulls":5},"Symbol","Unit","Value","Ref.",{"$nulls":5},"Material Properties see table F.1 and Tab. 5",{"$nulls":11},"List"]
["Form of plate (Rectangular / Circle)",{"$nulls":5},"R / C",null,{"$f":"Summary!C18","v":0},"Annex C",{"$nulls":5},"Table F.1 mechanical properties [MPa]",null,null,"Tab. 5",{"$nulls":8},"Lists"]
["Long side",{"$nulls":5},"a","mm",{"$f":"Summary!D18","v":0},"7.3, Annex C",{"$nulls":5},"Material","strength","elasticity","safety",{"$nulls":7},"rectangular","R","I","A",{"$f":"IF(I8=\"rectangular\",\"R\",IF(I8=\"circle\",\"C\",\"\"))","v":""}]
["Unsupported short side",{"$nulls":5},"b","mm",{"$f":"Summary!E18","v":0},"7.3, Annex C",{"$nulls":5},"PMMA",110,3000,3.5,{"$nulls":7},"circle","C","IIa","B"]
["Diameter",{"$nulls":5},"d","mm",{"$f":"Summary!F18","v":0},"7.3, Annex C",{"$nulls":5},"PC",90,2400,3.5,{"$nulls":9},"IIb","C"]
["Curve height",{"$nulls":5},"c","mm",{"$f":"Summary!G18","v":0},"7.6",{"$nulls":5},"TG",200,72600,4,{"$nulls":9},"III","D"]
["Support SemiFixed / Simply Supported",{"$nulls":5},"SF / SS",null,{"$f":"Summary!H18","v":0},"3.18",{"$nulls":5},"CG",300,72600,4,{"$nulls":7},"semi-fixed","SF","IV",null,{"$f":"IF(I13=\"semi-fixed\",\"SF\",IF(I13=\"\",\"\",\"SS\"))","v":"SS"}]
["Location type",{"$nulls":5},"I/IIA/IIB/III/IV",null,{"$f":"Summary!I18","v":0},"3.17; Annex A",{"$nulls":5},"AG",40,72600,4,{"$nulls":7},"simply supported","SS"]
["Location area (only loc. III)",{"$nulls":5},"F / S / Any",null,{"$f":"Summary!J18","v":0},"3.17.4",{"$nulls":5},"AMPW",50,7000,2]
["Design Category",{"$nulls":5},"A / B / C / D",null,{"$f":"Summary!K18","v":0},"3.12",{"$nulls":5},"GRP M30",140,7500,2,{"$nulls":6},"any","front","F","Any","yes",{"$f":"IF(I15=\"front\",\"F\",IF(I15=\"side\",\"S\",IF(I15=\"any\",\"A\",\"\")))","v":""}]
["Craft Type Any/Motor/Sail",{"$nulls":5},"Any / M / S",null,{"$f":"Summary!L18","v":0},{"$nulls":6},"GRP M35",175,10000,2,{"$nulls":6},"motor","side","S","M","no"]
["Length of hull as in ISO 8666",{"$nulls":5},"LH","m",{"$f":"Summary!N18","v":{"v":0,"d":"0.00"}},"3.16",{"$nulls":5},"AL 5038",280,70000,2,{"$nulls":6},"sail","any","Any","S",null,{"$f":"IF(I17=\"any\",\"Any\",IF(I17=\"motor\",\"M\",IF(I17=\"sail\",\"S\",\"\")))","v":""}]
["Material data",{"$nulls":7},{"$f":"Summary!O18","v":0},"Table F.1 & 5",{"$nulls":5},"MS",400,200000,2]
[null,"  Ultimate flexural strength",{"$nulls":4},"σU","MPa",{"$f":"'main Side windows 10'!D18","v":{"$error":"#N/A"}},"Table F.1 & 5",{"$nulls":5},"AISI 316 L",510,200000,2]
[null,"  Modulus of elasticity",{"$nulls":4},"E","MPa",{"$f":"'main Side windows 10'!D19","v":{"$error":"#N/A"}},"Table F.1 & 5"]
[null,"  Safety factor",{"$nulls":4},"gamma",". / .",{"$f":"'main Side windows 10'!D20","v":{"$error":"#N/A"}},"Table F.1 & 5",{"$nulls":15},"yes"]
["Is actual plate a sandwich?",{"$nulls":5},"yes / no",null,{"$f":"Summary!Q18","v":0},"7.9",{"$nulls":5},{"$f":"IF(I23=\"YES\",\"The difference in thickness between any two glass plies must be less than or equal to 2 mm and the thickness of the plastic interlayer must be less than, or equal to 0,76 mm for these conditions !\",\"\")","v":""},{"$nulls":9},"no"]
[null,"If yes, enter number of layers",{"$nulls":5},". / .",{"$f":"Summary!R18","v":0},"7.9"]
["Actual plate thickness (in case of sandwich the sum of all layers)",{"$nulls":6},"mm",{"$f":"Summary!U18","v":{"v":0,"d":"0.00"}}]
[]
["Results for non-stiffened plates"]
["Press reduction factor",{"$nulls":5},"Ψ",". / .",{"$f":"'main Side windows 10'!D23","v":false},"7.5"]
["              within limits 0,33 and 1,0",{"$nulls":7},{"$f":"'main Side windows 10'!D24","v":1},"7.5",{"$nulls":5},"Table 5 — Safety factor and minimum thickness of monolithic plates"]
["Basic design press",{"$nulls":5},"p","kPa",{"$f":"'main Side windows 10'!D25","v":1},"7.4",{"$nulls":5},"Material","Acronym","Safety factor\n γ ","Minimum thickness of monolithic plates, tm"]
["Allowable flexural stress",{"$nulls":5},"σa","MPa",{"$f":"'main Side windows 10'!D26","v":{"$error":"#N/A"}},"7.8",{"$nulls":8},"Design categories "]
["Curvature coefficient",{"$nulls":5},"kC",". / .",{"$f":"'main Side windows 10'!D27","v":{"$error":"#DIV/0!"}},"7.6",{"$nulls":8},"Any",null,"A & B","C & D"]
["Ratio a/b (valid ≤ 5)",{"$nulls":6},". / .",{"$f":"'main Side windows 10'!D28","v":{"$error":"#DIV/0!"}},"7.3, Annex G.2",{"$nulls":8},"Area Ia","Area II","Area III & IV","Area III & IV"]
["Ratio a/b corrected",{"$nulls":6},". / .",{"$f":"'main Side windows 10'!D29","v":{"$error":"#DIV/0!"}},"7.3, Annex G.2",{"$nulls":5},"Poly(methyl)methacrylate","PMMA",3.5,"6+0,1(LH-4)",6,5,4]
["Plate aspect ratio coeff stress",{"$nulls":5},"kr",". / .",{"$f":"'main Side windows 10'!D30","v":"FALSCH"},"7.3, Annex G.2",{"$nulls":5},"Polycarbonate","PC",3.5,"6+0,1(LH-4)",6,5,4]
["Pate aspect ratio coeff deflection",{"$nulls":5},"kf",". / .",{"$f":"'main Side windows 10'!D31","v":false},"7.3, Annex G.2",{"$nulls":5},"Monolithic tempered glass ","TG",4,"5+0,1(LH-4)b",4,4,3]
[{"$nulls":15},"Laminated glass ","LG",4,"5+0,1(LH-4)b",4,4,3]
["Thickness (Stress)",{"$nulls":5},"tr","mm",{"$f":"'main Side windows 10'!D33","v":{"$error":"#DIV/0!"}},"7.1.1",{"$nulls":5},"All mahogany plywood ","AMPW",2,"8+0,1(LH-4)",6,5,4]
["Thickness (Deflection)",{"$nulls":5},"tf","mm",{"$f":"'main Side windows 10'!D34","v":{"$error":"#DIV/0!"}},"7.1.2",{"$nulls":5},"GRP mat 30 % glass ","GRP M30",2,"4+0,1(LH-4)",3,3,2]
["Thickness",{"$nulls":6},"mm",{"$f":"'main Side windows 10'!D35","v":{"$error":"#DIV/0!"}},{"$nulls":6},"GRP mat/roving 35 % glass ","GRP M35",2,"4+0,1(LH-4)",3,3,2]
["Thickness minimu, techn. ",{"$nulls":5},"tm","mm",{"$f":"'main Side windows 10'!D36","v":{"$error":"#DIV/0!"}},"7.8",{"$nulls":5},"Aluminium alloy 5083-H111 ","AL 5038",2,"3+0,05 (LH-4)",3,3,2]
["Thickness minimum, Tab 5",{"$nulls":6},"mm",{"$f":"'main Side windows 10'!D37","v":{"v":0,"d":"0.0"}},"Table 5",{"$nulls":5},"Mild steel ","MS",2,"2,5+0,025 (LH-4)",2.5,2.5,2]
[]
["Required plate thickness",{"$nulls":6},"mm",{"$f":"'main Side windows 10'!I31","v":{"$error":"#DIV/0!"}}]
["Requirements fullfilled?",{"$nulls":7},{"$f":"IF(L13=\"short side in area I max 300mm\",\"FAIL\",IF(I25>=I44,\"PASS\",\"FAIL\"))","v":{"$error":"#DIV/0!"}}]

{"sheet":"main Side windows 10","index":32,"n_rows":43,"n_cols":24,"rows_kept":43,"hidden":true,"merged":[[0,0,0,5],[1,0,1,5],[25,11,28,18],[26,6,26,7]]}
[{"$nulls":6},"manufacturer"]
[{"$nulls":6},"model name"]
["Eingabe","Version 1.2.2 / 15-03-2006 rev 060512/070507/dew 090918",{"$nulls":4},"ISO/FDIS 12216:2002(E)"]
["Parameter Input","SSign","Item/Unit",{"$nulls":18},"Lists"]
["form of plate Rectangular/Circle",null,"R/C",{"$f":"'Worksheet 10'!AE9","v":""},{"$f":"IF(D5=\"\",\"Input R oder C\",\"\")","v":"Input R oder C"},null,"Material Properties see table F.1 and Tab. 5",{"$nulls":14},"R","I","A"]
["long side","a","mm",{"$f":"'Worksheet 10'!I9","v":0},{"$f":"IF(AND(D5=\"R\",D6=\"\"),\"Input a requested\",IF(AND(D5=\"C\",D6=\"\"),\"Input d requested\",\"\"))","v":""},null,"Table F.1 mechanical properties [Mpa]",null,null,"Tab. 5",{"$nulls":11},"C","IIa","B"]
["unsupported short side","b","mm",{"$f":"'Worksheet 10'!I10","v":0},{"$f":"IF(AND(D5=\"R\",D7=\"\"),\"Input b requested\",IF(AND(D5=\"C\",D7=\"\"),\"Input d requested\",\"\"))","v":""},null,"Material","strength","elasticity","safety",{"$nulls":12},"IIb","C"]
["diameter","d","mm",{"$f":"'Worksheet 10'!I11","v":0},{"$f":"IF(AND(D5=\"C\",D8=\"\"),\"Input d requested\",\"\")","v":""},null,"PMMA",110,3000,3.5,{"$nulls":3},"AG",40,72600,4,{"$nulls":5},"III","D"]
["curve height","c","mm",{"$f":"'Worksheet 10'!I12","v":0},"optional",null,"PC",90,2400,3.5,{"$nulls":3},"AISI 316 L",510,200000,2,{"$nulls":4},"SF","IV"]
["support SemiFixed/Simple Supp.",null,"SF/SS",{"$f":"'Worksheet 10'!AE13","v":"SS"},{"$f":"IF(D10=\"\",\"Input SF or SS\",\"\")","v":""},null,"TG",200,72600,4,null,null,"6.1","AL 5038",280,70000,2,{"$nulls":4},"SS"]
["Location type",null,"I/IIA/IIB/III/IV",{"$f":"'Worksheet 10'!I14","v":{"v":0,"d":"0.00"}},{"$f":"IF(D11=\"\",\"Input I / IIa,b / III / IV\",\"\")","v":""},null,"CG",300,72600,4,null,null,"3.17.1-4","AMPW",50,7000,2]
["Location area (only loc. III)",null,"F/S/A",{"$f":"'Worksheet 10'!AE16","v":""},{"$f":"IF(D12=\"F\",\"\",IF(D12=\"S\",\"\",IF(D12=\"A\",\"\",IF(D11=\"III\",\"Input F / S / A\",\"\"))))","v":""},null,"AG",40,72600,4,{"$nulls":3},"CG",300,72600,4,{"$nulls":4},"F","Any","yes"]
["Design Category",null,"A/B/C/D",{"$f":"IF('Worksheet 10'!I16=\"\",\"\",'Worksheet 10'!I16)","v":{"v":0,"d":"0.00"}},{"$f":"IF(D13=\"\",\"Input A / B / C / D\",\"\")","v":""},null,"AMPW",50,7000,2,{"$nulls":3},"GRP M30",140,7500,2,{"$nulls":4},"S","M","no"]
["Craft Type Any/Motor/Sail",null,"Any/M/S",{"$f":"'Worksheet 10'!AE18","v":""},{"$f":"IF(D14=\"\",\"Input Any / M / S\",\"\")","v":"Input Any / M / S"},null,"GRP M30",140,7500,2,{"$nulls":3},"GRP M35",175,10000,2,{"$nulls":4},"A","S"]
["optional: craft length of hull",null,"m",{"$f":"'Worksheet 10'!I18","v":{"v":0,"d":"0.00"}},"default, change if smaller",null,"GRP M35",175,10000,2,{"$nulls":3},"MS",400,200000,2]
[{"$nulls":6},"AL 5038",280,70000,2,{"$nulls":3},"PC",90,2400,3.5]
["Material",null,"see Tab. F.1",{"$f":"'Worksheet 10'!I19","v":{"v":0,"d":"0.00"}},{"$f":"IF(D17=\"\",\"manual input requ\",\"\")","v":""},null,"MS",400,200000,2,{"$nulls":3},"PMMA",110,3000,3.5]
["  ultimate flexural strength","Sigma u",null,{"$f":"LOOKUP(D17,N8:N18,O8:O18)","v":{"$error":"#N/A"}},"falls nicht in F.1 ",null,"AISI 316 L",510,200000,2,{"$nulls":3},"TG",200,72600,4]
["  modulus of elasticity","E",null,{"$f":"LOOKUP(D17,N8:N18,P8:P18)","v":{"$error":"#N/A"}},"Werte manuell"]
["  safety factor","gamma",null,{"$f":"LOOKUP(D17,N8:N18,Q8:Q18)","v":{"$error":"#N/A"}},"eintragen"]
[]
["Results for non-stiffened plates"]
["press reduction factor",null,null,{"$f":"IF(D5=\"R\",1.102-0.0004*D7,IF(D5=\"C\",1.102-0.0004*D8))","v":false},"(7.5)"]
["              within limits 0,33 and 1,0","psi",null,{"$f":"IF(D23<0.33,0.33,IF(D23>1,1,D23))","v":{"v":1,"d":"1.000"}},"(7.5)"]
["basic design press","p","KPa",{"$f":"'basic design pressure 10'!G43","v":{"v":1,"d":"1.00"}},"(7.4)",null,"see work sheet \"basic design press\""]
["allowable flexural stress","Sigma a","MPa",{"$f":"D18/D20","v":{"$error":"#N/A"}},"(7.8)",null,"is actual plate a sandwich?",null,{"$f":"'Worksheet 10'!I23","v":0},null,null,{"$f":"IF(I26=\"YES\",\"the difference in thickness between any two glass plies must be less than or equal to 2 mm and the thickness of the plastic interlayer must be less than, or equal to 0,76 mm for these conditions !\",\"\")","v":""}]
["curvature coefficient","kc",null,{"$f":"IF(D5=\"C\",1-(D9/D8),1-(D9/D7))","v":{"$error":"#DIV/0!"}},"(7.6)",null,{"$f":"IF(I26=\"yes\", \"number of layers?\",\"\")","v":""},null,{"$f":"IF('Worksheet 10'!I24=\"\",\"\",'Worksheet 10'!I24)","v":0}]
["              a/b real  (valid ≤ 5)",null,null,{"$f":"IF(D5=\"C\",1,D6/D7)","v":{"$error":"#DIV/0!"}},"(7.3) Annex G.2"]
["              a/b corrected",null,null,{"$f":"IF(D28>5,5,D28)","v":{"$error":"#DIV/0!"}},"(7.3) Annex G.2"]
["plate aspect ratio coeff stress","kr",null,{"$f":"IF(D5=\"R\",IF(D10=\"SF\",(0.62165*D29^2-0.6473*D29+0.26481)/(D29^2-1.173*D29+0.97671),IF(D10=\"SS\",(0.69952*D29^2+0.02662*D29-0.0735)/(D29^2-0.7185*D29+1.98925),\"Fehler\")),IF(D5=\"C\",IF(D10=\"SF\",0.248,0.309),\"FALSCH\"))","v":"FALSCH"},"(7.3) Annex G.2",null,"actual plate Thickness",null,{"$f":"'Worksheet 10'!I25","v":0},"mm",null,{"$f":"IF(I26=\"yes\", \"=sum of all plies\",\"\")","v":""}]
["pate aspect ratio coeff deflection","kf",null,{"$f":"IF(D5=\"R\",IF(D10=\"SF\",(0.08052*D29^2-0.0272*D29-0.0019)/(D29^2-0.9275*D29+1.70018),IF(D10=\"SS\",(0.12915*D29^2+0.00868*D29-0.0293)/(D29^2-0.887*D29+2.3372),\"Fehler\")),IF(D5=\"C\",IF(D10=\"SF\",0.027,0.043)))","v":false},"(7.3) Annex G.2",null,"required plate thickness",null,{"$f":"IF(AND(I26=\"Yes\",I27=\"\"),\"please enter number of layers\",IF(AND(I26=\"Yes\",I27>2),1.5*MAX(D35:D37),IF(AND(I26=\"Yes\",I27=2),1.2*MAX(D35:D37),IF(I36=\"Yes\",MAX(D36:D37),MAX(D35:D37)))))","v":{"$error":"#DIV/0!"}}]
[{"$nulls":6},"requirements fulfilled?",null,{"$f":"IF(I30=\"\",\"\",IF(I30>=I31,\"PASS\",\"FAIL\"))","v":{"$error":"#DIV/0!"}}]
["Thickness (Stress)","tr","mm",{"$f":"IF(D5=\"C\",D8*D27*SQRT(D30*D24*D25/D26/1000),D7*D27*SQRT(D30*D24*D25/D26/1000))","v":{"$error":"#DIV/0!"}},"(7.1.1)"]
["Thickness (Deflection)","tf","mm",{"$f":"0.45*(D33+D7*D27*POWER((D31*D24*D25/0.02/D19/1000),0.33333))","v":{"$error":"#DIV/0!"}},"(7.1.2)"]
["Thickness",null,null,{"$f":"ROUND(MAX(D33:D34),2)","v":{"$error":"#DIV/0!"}},"(7.1.7)",{"$nulls":3},"Minimum tech used???"]
["Thickness minimu, techn. ",null,"mm",{"$f":"D35-0.5","v":{"$error":"#DIV/0!"}},null,null," = Minimum, absolute",null,{"$f":"Summary!P18","v":0}]
["Thickness minimum, Tab 5","tm","mm",{"$f":"'basic design pressure 10'!J48","v":{"v":0,"d":"0.0"}},"(Tab. 5)",null,"(only PMMA, PC, TG, LG)"]
[]
["Escape Hatch possible ?"]
["Required ISO 9094-1, 2"]
["Circular: inner Diam > 450 mm",null,null,{"$f":"IF(D5=\"C\",IF(D8>450,\"pass\",\"fail\"),\"n.a.\")","v":"n.a."}]
["Rectang: inner Diam > 380 mm",null,null,{"$f":"IF(D5=\"R\",IF(MAX(D6:D7)>380,\"pass\",\"fail\"),\"n.a.\")","v":"n.a."}]
["              Area > 180000 mm²",null,null,{"$f":"IF(D5=\"R\",IF(D6*D7>180000,\"pass\",\"fail\"),\"n.a.\")","v":"n.a."}]

{"sheet":"basic design pressure 10","index":33,"n_rows":193,"n_cols":10,"rows_kept":193,"hidden":true}
["Basic design pressure",null,null,"(7.4 Table 4)"]
[]
["location",null,{"$f":"'main Side windows 10'!D11","v":0}]
["particular",null,{"$f":"IF(AND(C5=\"C\",C6=\"M\",C3=\"III\"),\"A\",'main Side windows 10'!D12)","v":""},null,"Remark: f=front, s=side"]
["design cat",null,{"$f":"'main Side windows 10'!D13","v":0}]
["craft type",null,{"$f":"'main Side windows 10'!D14","v":""},{"$f":"IF(C6=\"Any\",\"S\",C6)","v":""},"Remark: if craft type = Any, set craft type = S"]
[]
[]
["Tabelle 4",null,"location","craft type","design cat","particular","pressure"]
[null,null,"I","Any","Any","Any",70]
[null,null,"IIB","Any","A","Any",70]
[null,null,"IIB","Any","B","Any",50]
[null,null,"IIB","Any","C","Any",28]
[null,null,"IIB","Any","D","Any",28]
[null,null,"IIA","Any","Any","Any",28]
[null,null,"III","S","A","Any",18]
[null,null,"III","S","B","Any",18]
[null,null,"III","S","C","Any",12]
[null,null,"III","S","D","Any",12]
[null,null,"III","M","A","Front",12]
[null,null,"III","M","A","Any",12]
[null,null,"III","M","B","Front",9]
[null,null,"III","M","B","Any",9]
[null,null,"III","M","D","Front",6,null,null,"Korrektur, Zeile eingefügt um Fehler bei eingabe III, M, Front, D zu beheben"]
[null,null,"III","M","A","Side",9]
[null,null,"III","M","B","Side",6]
[null,null,"III","M","C","Any",6]
[null,null,"III","M","D","Any",6]
[null,null,"IV","S","Any","Any",12]
[null,null,"IV","M","Any","Any",6]
[]
["Ergebnis"]
[null,"location = I",{"$nulls":4},{"$f":"IF(C3=\"I\",G10,0)","v":0}]
[null,"location = IIB",{"$nulls":4},{"$f":"IF(C3=\"IIB\",VLOOKUP(C5,E11:G15,3),0)","v":0}]
[null,"location = IIA",{"$nulls":4},{"$f":"IF(C3=\"IIA\",VLOOKUP(C3,E11:G15,3),0)","v":0}]
[null,"location = III","craft = S",{"$nulls":3},{"$f":"IF(AND(C3=\"III\",D6=\"S\"),VLOOKUP(C5,E16:G19,3),0)","v":0}]
[null,"location = III","craft = M","particular = front",null,null,{"$f":"IF(AND(C3=\"III\",D6=\"M\",C4=\"F\"),VLOOKUP(C5,E20:G24,3),0)","v":0}]
[null,"location = III","craft = M","particular = any",null,null,{"$f":"IF(AND(OR(C5=\"A\",C5=\"B\"),C3=\"III\",D6=\"M\",C4=\"A\"),VLOOKUP(C5,E20:G24,3),0)","v":0}]
[null,"location = III","craft = M","particular = side",null,null,{"$f":"IF(AND(C3=\"III\",C6=\"M\",C4=\"S\"),IF(C5=\"A\",9,IF(C5=\"B\",6,0)))","v":false}]
[null,"location = III","craft = M",{"$nulls":3},{"$f":"IF(C5=\"A\",0,IF(C5=\"B\",0,IF(AND(C3=\"III\",C6=\"M\"),VLOOKUP(C5,E27:G28,3))))","v":false}]
[null,"location = IV",{"$nulls":4},{"$f":"IF(C3=\"IV\",VLOOKUP(D6,D29:G30,4,0),1)","v":1}]
[]
["pressure",{"$nulls":5},{"$f":"MAX(G33:G41)","v":1}]
[]
[]
["minimum thickness"]
[]
[null,"Area",{"$f":"IF(OR('main Side windows 10'!D11=\"IIA\",'main Side windows 10'!D11=\"IIB\"),\"II\",'main Side windows 10'!D11)","v":0},{"$nulls":4},"minimum thickness",null,{"$f":"MAX(J50:J190)","v":0}]
[]
[null,null,"PMMA","A","I",{"$f":" IF('main Side windows 10'!$D$15>0,6 + 0.1*('main Side windows 10'!$D$15-4),\"\")","v":""},{"$nulls":3},{"$f":"IF('main Side windows 10'!$D$17=\"PMMA\",(IF('main Side windows 10'!$D$13=\"A\",VLOOKUP($C$48,$E$50:$F$53,2,-1),0)),0)","v":0}]
["Table 5",{"$nulls":3},"II",6]
[{"$nulls":4},"III",5]
[{"$nulls":4},"IV",5]
[null,null,"PMMA","B","I",{"$f":" IF('main Side windows 10'!$D$15>0,6 + 0.1*('main Side windows 10'!$D$15-4),\"\")","v":""},{"$nulls":3},{"$f":"IF('main Side windows 10'!$D$17=\"PMMA\",(IF('main Side windows 10'!$D$13=\"B\",VLOOKUP($C$48,$E$54:$F$57,2,-1),0)),0)","v":0}]
[{"$nulls":4},"II",6]
[{"$nulls":4},"III",5]
[{"$nulls":4},"IV",5]
[null,null,"PMMA","C","I",{"$f":" IF('main Side windows 10'!$D$15>0,6 + 0.1*('main Side windows 10'!$D$15-4),\"\")","v":""},{"$nulls":3},{"$f":"IF('main Side windows 10'!$D$17=\"PMMA\",(IF('main Side windows 10'!$D$13=\"C\",VLOOKUP($C$48,$E$58:$F$61,2,-1),0)),0)","v":0}]
[{"$nulls":4},"II",6]
[{"$nulls":4},"III",4]
[{"$nulls":4},"IV",4]
[null,null,"PMMA","D","I",{"$f":" IF('main Side windows 10'!$D$15>0,6 + 0.1*('main Side windows 10'!$D$15-4),\"\")","v":""},{"$nulls":3},{"$f":"IF('main Side windows 10'!$D$17=\"PMMA\",(IF('main Side windows 10'!$D$13=\"D\",VLOOKUP($C$48,E62:F65,2,-1),0)),0)","v":0}]
[{"$nulls":4},"II",6]
[{"$nulls":4},"III",4]
[{"$nulls":4},"IV",4]
[null,null,"PC","A","I",{"$f":" IF('main Side windows 10'!$D$15>0,6 + 0.1*('main Side windows 10'!$D$15-4),\"\")","v":""},{"$nulls":3},{"$f":"IF('main Side windows 10'!$D$17=\"PC\",(IF('main Side windows 10'!$D$13=\"A\",VLOOKUP($C$48,E66:F69,2,-1),0)),0)","v":0}]
[{"$nulls":4},"II",6]
[{"$nulls":4},"III",5]
[{"$nulls":4},"IV",5]
[null,null,"PC","B","I",{"$f":" IF('main Side windows 10'!$D$15>0,6 + 0.1*('main Side windows 10'!$D$15-4),\"\")","v":""},{"$nulls":3},{"$f":"IF('main Side windows 10'!$D$17=\"PC\",(IF('main Side windows 10'!$D$13=\"B\",VLOOKUP($C$48,E70:F73,2,-1),0)),0)","v":0}]
[{"$nulls":4},"II",6]
[{"$nulls":4},"III",5]
[{"$nulls":4},"IV",5]
[null,null,"PC","C","I",{"$f":" IF('main Side windows 10'!$D$15>0,6 + 0.1*('main Side windows 10'!$D$15-4),\"\")","v":""},{"$nulls":3},{"$f":"IF('main Side windows 10'!$D$17=\"PC\",(IF('main Side windows 10'!$D$13=\"C\",VLOOKUP($C$48,E74:F77,2,-1),0)),0)","v":0}]
[{"$nulls":4},"II",6]
[{"$nulls":4},"III",4]
[{"$nulls":4},"IV",4]
[null,null,"PC","D","I",{"$f":" IF('main Side windows 10'!$D$15>0,6 + 0.1*('main Side windows 10'!$D$15-4),\"\")","v":""},{"$nulls":3},{"$f":"IF('main Side windows 10'!$D$17=\"PC\",(IF('main Side windows 10'!$D$13=\"D\",VLOOKUP($C$48,E78:F81,2,-1),0)),0)","v":0}]
[{"$nulls":4},"II",6]
[{"$nulls":4},"III",4]
[{"$nulls":4},"IV",4]
[null,null,"TG","A","I",{"$f":" IF('main Side windows 10'!$D$15>0,5+ 0.1*('main Side windows 10'!$D$15-4),\"\")","v":""},{"$nulls":3},{"$f":"IF('main Side windows 10'!$D$17=\"TG\",(IF('main Side windows 10'!$D$13=\"A\",VLOOKUP($C$48,E82:F85,2,-1),0)),0)","v":0}]
[{"$nulls":4},"II",4]
[{"$nulls":4},"III",4]
[{"$nulls":4},"IV",4]
[null,null,"TG","B","I",{"$f":" IF('main Side windows 10'!$D$15>0,5+ 0.1*('main Side windows 10'!$D$15-4),\"\")","v":""},{"$nulls":3},{"$f":"IF('main Side windows 10'!$D$17=\"TG\",(IF('main Side windows 10'!$D$13=\"B\",VLOOKUP($C$48,E86:F89,2,-1),0)),0)","v":0}]
[{"$nulls":4},"II",4]
[{"$nulls":4},"III",4]
[{"$nulls":4},"IV",4]
[null,null,"TG","C","I",{"$f":" IF('main Side windows 10'!$D$15>0,5+ 0.1*('main Side windows 10'!$D$15-4),\"\")","v":""},{"$nulls":3},{"$f":"IF('main Side windows 10'!$D$17=\"TG\",(IF('main Side windows 10'!$D$13=\"C\",VLOOKUP($C$48,E90:F93,2,-1),0)),0)","v":0}]
[{"$nulls":4},"II",4]
[{"$nulls":4},"III",3]
[{"$nulls":4},"IV",3]
[null,null,"TG","D","I",{"$f":" IF('main Side windows 10'!$D$15>0,5+ 0.1*('main Side windows 10'!$D$15-4),\"\")","v":""},{"$nulls":3},{"$f":"IF('main Side windows 10'!$D$17=\"TG\",(IF('main Side windows 10'!$D$13=\"D\",VLOOKUP($C$48,E94:F97,2,-1),0)),0)","v":0}]
[{"$nulls":4},"II",4]
[{"$nulls":4},"III",3]
[{"$nulls":4},"IV",3]
[null,null,"LG","A","I",{"$f":" IF('main Side windows 10'!$D$15>0,5+ 0.1*('main Side windows 10'!$D$15-4),\"\")","v":""},{"$nulls":3},{"$f":"IF('main Side windows 10'!$D$17=\"LG\",(IF('main Side windows 10'!$D$13=\"A\",VLOOKUP($C$48,E98:F101,2,-1),0)),0)","v":0}]
[{"$nulls":4},"II",4]
[{"$nulls":4},"III",4]
[{"$nulls":4},"IV",4]
[null,null,"LG","B","I",{"$f":" IF('main Side windows 10'!$D$15>0,5+ 0.1*('main Side windows 10'!$D$15-4),\"\")","v":""},{"$nulls":3},{"$f":"IF('main Side windows 10'!$D$17=\"LG\",(IF('main Side windows 10'!$D$13=\"B\",VLOOKUP($C$48,E102:F105,2,-1),0)),0)","v":0}]
[{"$nulls":4},"II",4]
[{"$nulls":4},"III",4]
[{"$nulls":4},"IV",4]
[null,null,"LG","C","I",{"$f":" IF('main Side windows 10'!$D$15>0,5+ 0.1*('main Side windows 10'!$D$15-4),\"\")","v":""},{"$nulls":3},{"$f":"IF('main Side windows 10'!$D$17=\"LG\",(IF('main Side windows 10'!$D$13=\"C\",VLOOKUP($C$48,E106:F109,2,-1),0)),0)","v":0}]
[{"$nulls":4},"II",4]
[{"$nulls":4},"III",3]
[{"$nulls":4},"IV",3]
[null,null,"LG","D","I",{"$f":" IF('main Side windows 10'!$D$15>0,5+ 0.1*('main Side windows 10'!$D$15-4),\"\")","v":""},{"$nulls":3},{"$f":"IF('main Side windows 10'!$D$17=\"LG\",(IF('main Side windows 10'!$D$13=\"D\",VLOOKUP($C$48,E110:F113,2,-1),0)),0)","v":0}]
[{"$nulls":4},"II",4]
[{"$nulls":4},"III",3]
[{"$nulls":4},"IV",3]
[null,null,"AMPW","A","I",{"$f":" IF('main Side windows 10'!$D$15>0,8+ 0.1*('main Side windows 10'!$D$15-4),\"\")","v":""},{"$nulls":3},{"$f":"IF('main Side windows 10'!$D$17=\"AMPW\",(IF('main Side windows 10'!$D$13=\"A\",VLOOKUP($C$48,E114:F117,2,-1),0)),0)","v":0}]
[{"$nulls":4},"II",6]
[{"$nulls":4},"III",5]
[{"$nulls":4},"IV",5]
[null,null,"AMPW","B","I",{"$f":" IF('main Side windows 10'!$D$15>0,8+ 0.1*('main Side windows 10'!$D$15-4),\"\")","v":""},{"$nulls":3},{"$f":"IF('main Side windows 10'!$D$17=\"AMPW\",(IF('main Side windows 10'!$D$13=\"B\",VLOOKUP($C$48,E118:F121,2,-1),0)),0)","v":0}]
[{"$nulls":4},"II",6]
[{"$nulls":4},"III",5]
[{"$nulls":4},"IV",5]
[null,null,"AMPW","C","I",{"$f":" IF('main Side windows 10'!$D$15>0,8+ 0.1*('main Side windows 10'!$D$15-4),\"\")","v":""},{"$nulls":3},{"$f":"IF('main Side windows 10'!$D$17=\"AMPW\",(IF('main Side windows 10'!$D$13=\"C\",VLOOKUP($C$48,E122:F125,2,-1),0)),0)","v":0}]
[{"$nulls":4},"II",6]
[{"$nulls":4},"III",4]
[{"$nulls":4},"IV",4]
[null,null,"AMPW","D","I",{"$f":" IF('main Side windows 10'!$D$15>0,8+ 0.1*('main Side windows 10'!$D$15-4),\"\")","v":""},{"$nulls":3},{"$f":"IF('main Side windows 10'!$D$17=\"AMPW\",(IF('main Side windows 10'!$D$13=\"D\",VLOOKUP($C$48,E126:F129,2,-1),0)),0)","v":0}]
[{"$nulls":4},"II",6]
[{"$nulls":4},"III",4]
[{"$nulls":4},"IV",4]
[null,null,"GRP m30","A","I",{"$f":" IF('main Side windows 10'!$D$15>0,4 + 0.1*('main Side windows 10'!$D$15-4),\"\")","v":""},{"$nulls":3},{"$f":"IF('main Side windows 10'!$D$17=\"GRP M30\",(IF('main Side windows 10'!$D$13=\"A\",VLOOKUP($C$48,E130:F133,2,-1),0)),0)","v":0}]
[{"$nulls":4},"II",3]
[{"$nulls":4},"III",3]
[{"$nulls":4},"IV",3]
[null,null,"GRP m30","B","I",{"$f":" IF('main Side windows 10'!$D$15>0,4 + 0.1*('main Side windows 10'!$D$15-4),\"\")","v":""},{"$nulls":3},{"$f":"IF('main Side windows 10'!$D$17=\"GRP M30\",(IF('main Side windows 10'!$D$13=\"B\",VLOOKUP($C$48,E134:F137,2,-1),0)),0)","v":0}]
[{"$nulls":4},"II",3]
[{"$nulls":4},"III",3]
[{"$nulls":4},"IV",3]
[null,null,"GRP m30","C","I",{"$f":" IF('main Side windows 10'!$D$15>0,4 + 0.1*('main Side windows 10'!$D$15-4),\"\")","v":""},{"$nulls":3},{"$f":"IF('main Side windows 10'!$D$17=\"GRP M30\",(IF('main Side windows 10'!$D$13=\"C\",VLOOKUP($C$48,E138:F141,2,-1),0)),0)","v":0}]
[{"$nulls":4},"II",3]
[{"$nulls":4},"III",2]
[{"$nulls":4},"IV",2]
[null,null,"GRP m30","D","I",{"$f":" IF('main Side windows 10'!$D$15>0,4 + 0.1*('main Side windows 10'!$D$15-4),\"\")","v":""},{"$nulls":3},{"$f":"IF('main Side windows 10'!$D$17=\"GRP M30\",(IF('main Side windows 10'!$D$13=\"D\",VLOOKUP($C$48,E142:F145,2,-1),0)),0)","v":0}]
[{"$nulls":4},"II",3]
[{"$nulls":4},"III",2]
[{"$nulls":4},"IV",2]
[null,null,"GRP m35","A","I",{"$f":" IF('main Side windows 10'!$D$15>0,4 + 0.1*('main Side windows 10'!$D$15-4),\"\")","v":""},{"$nulls":3},{"$f":"IF('main Side windows 10'!$D$17=\"GRP M35\",(IF('main Side windows 10'!$D$13=\"A\",VLOOKUP($C$48,E146:F149,2,-1),0)),0)","v":0}]
[{"$nulls":4},"II",3]
[{"$nulls":4},"III",3]
[{"$nulls":4},"IV",3]
[null,null,"GRP m35","B","I",{"$f":" IF('main Side windows 10'!$D$15>0,4 + 0.1*('main Side windows 10'!$D$15-4),\"\")","v":""},{"$nulls":3},{"$f":"IF('main Side windows 10'!$D$17=\"GRP M35\",(IF('main Side windows 10'!$D$13=\"B\",VLOOKUP($C$48,E150:F153,2,-1),0)),0)","v":0}]
[{"$nulls":4},"II",3]
[{"$nulls":4},"III",3]
[{"$nulls":4},"IV",3]
[null,null,"GRP m35","C","I",{"$f":" IF('main Side windows 10'!$D$15>0,4 + 0.1*('main Side windows 10'!$D$15-4),\"\")","v":""},{"$nulls":3},{"$f":"IF('main Side windows 10'!$D$17=\"GRP M35\",(IF('main Side windows 10'!$D$13=\"C\",VLOOKUP($C$48,E154:F157,2,-1),0)),0)","v":0}]
[{"$nulls":4},"II",3]
[{"$nulls":4},"III",2]
[{"$nulls":4},"IV",2]
[null,null,"GRP m35","D","I",{"$f":" IF('main Side windows 10'!$D$15>0,4 + 0.1*('main Side windows 10'!$D$15-4),\"\")","v":""},{"$nulls":3},{"$f":"IF('main Side windows 10'!$D$17=\"GRP M35\",(IF('main Side windows 10'!$D$13=\"D\",VLOOKUP($C$48,E158:F161,2,-1),0)),0)","v":0}]
[{"$nulls":4},"II",3]
[{"$nulls":4},"III",2]
[{"$nulls":4},"IV",2]
[null,null,"Al 5038","A","I",{"$f":" IF('main Side windows 10'!$D$15>0,3 + 0.05*('main Side windows 10'!$D$15-4),\"\")","v":""},{"$nulls":3},{"$f":"IF('main Side windows 10'!$D$17=\"Al 5038\",(IF('main Side windows 10'!$D$13=\"A\",VLOOKUP($C$48,E162:F165,2,-1),0)),0)","v":0}]
[{"$nulls":4},"II",3]
[{"$nulls":4},"III",3]
[{"$nulls":4},"IV",3]
[null,null,"Al 5038","B","I",{"$f":" IF('main Side windows 10'!$D$15>0,3 + 0.05*('main Side windows 10'!$D$15-4),\"\")","v":""},{"$nulls":3},{"$f":"IF('main Side windows 10'!$D$17=\"AL 5038\",(IF('main Side windows 10'!$D$13=\"B\",VLOOKUP($C$48,E166:F169,2,-1),0)),0)","v":0}]
[{"$nulls":4},"II",3]
[{"$nulls":4},"III",3]
[{"$nulls":4},"IV",3]
[null,null,"Al 5038","C","I",{"$f":" IF('main Side windows 10'!$D$15>0,3 + 0.05*('main Side windows 10'!$D$15-4),\"\")","v":""},{"$nulls":3},{"$f":"IF('main Side windows 10'!$D$17=\"AL 5038\",(IF('main Side windows 10'!$D$13=\"C\",VLOOKUP($C$48,E170:F173,2,-1),0)),0)","v":0}]
[{"$nulls":4},"II",3]
[{"$nulls":4},"III",2]
[{"$nulls":4},"IV",2]
[null,null,"Al 5038","D","I",{"$f":" IF('main Side windows 10'!$D$15>0,3 + 0.05*('main Side windows 10'!$D$15-4),\"\")","v":""},{"$nulls":3},{"$f":"IF('main Side windows 10'!$D$17=\"AL 5038\",(IF('main Side windows 10'!$D$13=\"D\",VLOOKUP($C$48,E174:F177,2,-1),0)),0)","v":0}]
[{"$nulls":4},"II",3]
[{"$nulls":4},"III",2]
[{"$nulls":4},"IV",2]
[null,null,"MS","A","I",{"$f":" IF('main Side windows 10'!$D$15>0,2.5 + 0.025*('main Side windows 10'!$D$15-4),\"\")","v":""},{"$nulls":3},{"$f":"IF('main Side windows 10'!$D$17=\"MS\",(IF('main Side windows 10'!$D$13=\"A\",VLOOKUP($C$48,E178:F181,2,-1),0)),0)","v":0}]
[{"$nulls":4},"II",2.5]
[{"$nulls":4},"III",2.5]
[{"$nulls":4},"IV",2.5]
[null,null,"MS","B","I",{"$f":" IF('main Side windows 10'!$D$15>0,2.5 + 0.025*('main Side windows 10'!$D$15-4),\"\")","v":""},{"$nulls":3},{"$f":"IF('main Side windows 10'!$D$17=\"MS\",(IF('main Side windows 10'!$D$13=\"B\",VLOOKUP($C$48,E182:F185,2,-1),0)),0)","v":0}]
[{"$nulls":4},"II",2.5]
[{"$nulls":4},"III",2.5]
[{"$nulls":4},"IV",2.5]
[null,null,"MS","C","I",{"$f":" IF('main Side windows 10'!$D$15>0,2.5 + 0.025*('main Side windows 10'!$D$15-4),\"\")","v":""},{"$nulls":3},{"$f":"IF('main Side windows 10'!$D$17=\"MS\",(IF('main Side windows 10'!$D$13=\"C\",VLOOKUP($C$48,E186:F189,2,-1),0)),0)","v":0}]
[{"$nulls":4},"II",2.5]
[{"$nulls":4},"III",2]
[{"$nulls":4},"IV",2]
[null,null,"MS","D","I",{"$f":" IF('main Side windows 10'!$D$15>0,2.5 + 0.025*('main Side windows 10'!$D$15-4),\"\")","v":""},{"$nulls":3},{"$f":"IF('main Side windows 10'!$D$17=\"MS\",(IF('main Side windows 10'!$D$13=\"D\",VLOOKUP($C$48,E190:F193,2,-1),0)),0)","v":0}]
[{"$nulls":4},"II",2.5]
[{"$nulls":4},"III",2]
[{"$nulls":4},"IV",2]

{"sheet":"Worksheet 11","index":34,"n_rows":45,"n_cols":31,"rows_kept":45,"merged":[[0,0,0,9],[0,11,0,12],[1,0,1,9],[2,0,2,9],[4,0,4,9],[6,0,6,5],[17,13,17,14],[19,13,19,14],[21,12,21,14],[22,15,26,18],[27,6,28,6],[27,7,28,7],[27,15,27,21],[29,15,32,15],[29,16,32,16],[29,17,32,17],[29,18,29,21],[30,18,30,21],[31,18,31,19],[32,11,32,13],[34,13,34,14],[36,13,36,14],[38,13,38,14],[39,13,39,14],[41,13,41,14]]}
[{"$nulls":11},"Comments"]
["ISO 12216:2020 - Small craft - Windows, portlights, hatches, deadlights and doors",{"$nulls":11},"Derived values"]
["WORKSHEET No. 1 data entry",{"$nulls":11},"Input values"]
[]
[{"$f":"CONCATENATE(coverSheet!B5,\"   \",coverSheet!B12,\"   \",Summary!B19)","v":"      "}]
[]
["Parameter",{"$nulls":5},"Symbol","Unit","Value","Ref.",{"$nulls":5},"Material Properties see table F.1 and Tab. 5",{"$nulls":11},"List"]
["Form of plate (Rectangular / Circle)",{"$nulls":5},"R / C",null,{"$f":"Summary!C19","v":0},"Annex C",{"$nulls":5},"Table F.1 mechanical properties [MPa]",null,null,"Tab. 5",{"$nulls":8},"Lists"]
["Long side",{"$nulls":5},"a","mm",{"$f":"Summary!D19","v":0},"7.3, Annex C",{"$nulls":5},"Material","strength","elasticity","safety",{"$nulls":7},"rectangular","R","I","A",{"$f":"IF(I8=\"rectangular\",\"R\",IF(I8=\"circle\",\"C\",\"\"))","v":""}]
["Unsupported short side",{"$nulls":5},"b","mm",{"$f":"Summary!E19","v":0},"7.3, Annex C",{"$nulls":5},"PMMA",110,3000,3.5,{"$nulls":7},"circle","C","IIa","B"]
["Diameter",{"$nulls":5},"d","mm",{"$f":"Summary!F19","v":0},"7.3, Annex C",{"$nulls":5},"PC",90,2400,3.5,{"$nulls":9},"IIb","C"]
["Curve height",{"$nulls":5},"c","mm",{"$f":"Summary!G19","v":0},"7.6",{"$nulls":5},"TG",200,72600,4,{"$nulls":9},"III","D"]
["Support SemiFixed / Simply Supported",{"$nulls":5},"SF / SS",null,{"$f":"Summary!H19","v":0},"3.18",{"$nulls":5},"CG",300,72600,4,{"$nulls":7},"semi-fixed","SF","IV",null,{"$f":"IF(I13=\"semi-fixed\",\"SF\",IF(I13=\"\",\"\",\"SS\"))","v":"SS"}]
["Location type",{"$nulls":5},"I/IIA/IIB/III/IV",null,{"$f":"Summary!I19","v":0},"3.17; Annex A",{"$nulls":5},"AG",40,72600,4,{"$nulls":7},"simply supported","SS"]
["Location area (only loc. III)",{"$nulls":5},"F / S / Any",null,{"$f":"Summary!J19","v":0},"3.17.4",{"$nulls":5},"AMPW",50,7000,2]
["Design Category",{"$nulls":5},"A / B / C / D",null,{"$f":"Summary!K19","v":0},"3.12",{"$nulls":5},"GRP M30",140,7500,2,{"$nulls":6},"any","front","F","Any","yes",{"$f":"IF(I15=\"front\",\"F\",IF(I15=\"side\",\"S\",IF(I15=\"any\",\"A\",\"\")))","v":""}]
["Craft Type Any/Motor/Sail",{"$nulls":5},"Any / M / S",null,{"$f":"Summary!L19","v":0},{"$nulls":6},"GRP M35",175,10000,2,{"$nulls":6},"motor","side","S","M","no"]
["Length of hull as in ISO 8666",{"$nulls":5},"LH","m",{"$f":"Summary!N19","v":{"v":0,"d":"0.00"}},"3.16",{"$nulls":5},"AL 5038",280,70000,2,{"$nulls":6},"sail","any","Any","S",null,{"$f":"IF(I17=\"any\",\"Any\",IF(I17=\"motor\",\"M\",IF(I17=\"sail\",\"S\",\"\")))","v":""}]
["Material data",{"$nulls":7},{"$f":"Summary!O19","v":0},"Table F.1 & 5",{"$nulls":5},"MS",400,200000,2]
[null,"  Ultimate flexural strength",{"$nulls":4},"σU","MPa",{"$f":"'main Side windows 11'!D18","v":{"$error":"#N/A"}},"Table F.1 & 5",{"$nulls":5},"AISI 316 L",510,200000,2]
[null,"  Modulus of elasticity",{"$nulls":4},"E","MPa",{"$f":"'main Side windows 11'!D19","v":{"$error":"#N/A"}},"Table F.1 & 5"]
[null,"  Safety factor",{"$nulls":4},"gamma",". / .",{"$f":"'main Side windows 11'!D20","v":{"$error":"#N/A"}},"Table F.1 & 5",{"$nulls":15},"yes"]
["Is actual plate a sandwich?",{"$nulls":5},"yes / no",null,{"$f":"Summary!Q19","v":0},"7.9",{"$nulls":5},{"$f":"IF(I23=\"YES\",\"The difference in thickness between any two glass plies must be less than or equal to 2 mm and the thickness of the plastic interlayer must be less than, or equal to 0,76 mm for these conditions !\",\"\")","v":""},{"$nulls":9},"no"]
[null,"If yes, enter number of layers",{"$nulls":5},". / .",{"$f":"Summary!R19","v":0},"7.9"]
["Actual plate thickness (in case of sandwich the sum of all layers)",{"$nulls":6},"mm",{"$f":"Summary!U19","v":{"v":0,"d":"0.00"}}]
[]
["Results for non-stiffened plates"]
["Press reduction factor",{"$nulls":5},"Ψ",". / .",{"$f":"'main Side windows 11'!D23","v":false},"7.5"]
["              within limits 0,33 and 1,0",{"$nulls":7},{"$f":"'main Side windows 11'!D24","v":1},"7.5",{"$nulls":5},"Table 5 — Safety factor and minimum thickness of monolithic plates"]
["Basic design press",{"$nulls":5},"p","kPa",{"$f":"'main Side windows 11'!D25","v":1},"7.4",{"$nulls":5},"Material","Acronym","Safety factor\n γ ","Minimum thickness of monolithic plates, tm"]
["Allowable flexural stress",{"$nulls":5},"σa","MPa",{"$f":"'main Side windows 11'!D26","v":{"$error":"#N/A"}},"7.8",{"$nulls":8},"Design categories "]
["Curvature coefficient",{"$nulls":5},"kC",". / .",{"$f":"'main Side windows 11'!D27","v":{"$error":"#DIV/0!"}},"7.6",{"$nulls":8},"Any",null,"A & B","C & D"]
["Ratio a/b (valid ≤ 5)",{"$nulls":6},". / .",{"$f":"'main Side windows 11'!D28","v":{"$error":"#DIV/0!"}},"7.3, Annex G.2",{"$nulls":8},"Area Ia","Area II","Area III & IV","Area III & IV"]
["Ratio a/b corrected",{"$nulls":6},". / .",{"$f":"'main Side windows 11'!D29","v":{"$error":"#DIV/0!"}},"7.3, Annex G.2",{"$nulls":5},"Poly(methyl)methacrylate","PMMA",3.5,"6+0,1(LH-4)",6,5,4]
["Plate aspect ratio coeff stress",{"$nulls":5},"kr",". / .",{"$f":"'main Side windows 11'!D30","v":"FALSCH"},"7.3, Annex G.2",{"$nulls":5},"Polycarbonate","PC",3.5,"6+0,1(LH-4)",6,5,4]
["Pate aspect ratio coeff deflection",{"$nulls":5},"kf",". / .",{"$f":"'main Side windows 11'!D31","v":false},"7.3, Annex G.2",{"$nulls":5},"Monolithic tempered glass ","TG",4,"5+0,1(LH-4)b",4,4,3]
[{"$nulls":15},"Laminated glass ","LG",4,"5+0,1(LH-4)b",4,4,3]
["Thickness (Stress)",{"$nulls":5},"tr","mm",{"$f":"'main Side windows 11'!D33","v":{"$error":"#DIV/0!"}},"7.1.1",{"$nulls":5},"All mahogany plywood ","AMPW",2,"8+0,1(LH-4)",6,5,4]
["Thickness (Deflection)",{"$nulls":5},"tf","mm",{"$f":"'main Side windows 11'!D34","v":{"$error":"#DIV/0!"}},"7.1.2",{"$nulls":5},"GRP mat 30 % glass ","GRP M30",2,"4+0,1(LH-4)",3,3,2]
["Thickness",{"$nulls":6},"mm",{"$f":"'main Side windows 11'!D35","v":{"$error":"#DIV/0!"}},{"$nulls":6},"GRP mat/roving 35 % glass ","GRP M35",2,"4+0,1(LH-4)",3,3,2]
["Thickness minimu, techn. ",{"$nulls":5},"tm","mm",{"$f":"'main Side windows 11'!D36","v":{"$error":"#DIV/0!"}},"7.8",{"$nulls":5},"Aluminium alloy 5083-H111 ","AL 5038",2,"3+0,05 (LH-4)",3,3,2]
["Thickness minimum, Tab 5",{"$nulls":6},"mm",{"$f":"'main Side windows 11'!D37","v":{"v":0,"d":"0.0"}},"Table 5",{"$nulls":5},"Mild steel ","MS",2,"2,5+0,025 (LH-4)",2.5,2.5,2]
[]
["Required plate thickness",{"$nulls":6},"mm",{"$f":"'main Side windows 11'!I31","v":{"$error":"#DIV/0!"}}]
["Requirements fullfilled?",{"$nulls":7},{"$f":"IF(L13=\"short side in area I max 300mm\",\"FAIL\",IF(I25>=I44,\"PASS\",\"FAIL\"))","v":{"$error":"#DIV/0!"}}]

{"sheet":"main Side windows 11","index":35,"n_rows":43,"n_cols":24,"rows_kept":43,"hidden":true,"merged":[[0,0,0,5],[1,0,1,5],[25,11,28,18],[26,6,26,7]]}
[{"$nulls":6},"manufacturer"]
[{"$nulls":6},"model name"]
["Eingabe","Version 1.2.2 / 15-03-2006 rev 060512/070507/dew 090918",{"$nulls":4},"ISO/FDIS 12216:2002(E)"]
["Parameter Input","SSign","Item/Unit",{"$nulls":18},"Lists"]
["form of plate Rectangular/Circle",null,"R/C",{"$f":"'Worksheet 11'!AE9","v":""},{"$f":"IF(D5=\"\",\"Input R oder C\",\"\")","v":"Input R oder C"},null,"Material Properties see table F.1 and Tab. 5",{"$nulls":14},"R","I","A"]
["long side","a","mm",{"$f":"'Worksheet 11'!I9","v":0},{"$f":"IF(AND(D5=\"R\",D6=\"\"),\"Input a requested\",IF(AND(D5=\"C\",D6=\"\"),\"Input d requested\",\"\"))","v":""},null,"Table F.1 mechanical properties [Mpa]",null,null,"Tab. 5",{"$nulls":11},"C","IIa","B"]
["unsupported short side","b","mm",{"$f":"'Worksheet 11'!I10","v":0},{"$f":"IF(AND(D5=\"R\",D7=\"\"),\"Input b requested\",IF(AND(D5=\"C\",D7=\"\"),\"Input d requested\",\"\"))","v":""},null,"Material","strength","elasticity","safety",{"$nulls":12},"IIb","C"]
["diameter","d","mm",{"$f":"'Worksheet 11'!I11","v":0},{"$f":"IF(AND(D5=\"C\",D8=\"\"),\"Input d requested\",\"\")","v":""},null,"PMMA",110,3000,3.5,{"$nulls":3},"AG",40,72600,4,{"$nulls":5},"III","D"]
["curve height","c","mm",{"$f":"'Worksheet 11'!I12","v":0},"optional",null,"PC",90,2400,3.5,{"$nulls":3},"AISI 316 L",510,200000,2,{"$nulls":4},"SF","IV"]
["support SemiFixed/Simple Supp.",null,"SF/SS",{"$f":"'Worksheet 11'!AE13","v":"SS"},{"$f":"IF(D10=\"\",\"Input SF or SS\",\"\")","v":""},null,"TG",200,72600,4,null,null,"6.1","AL 5038",280,70000,2,{"$nulls":4},"SS"]
["Location type",null,"I/IIA/IIB/III/IV",{"$f":"'Worksheet 11'!I14","v":{"v":0,"d":"0.00"}},{"$f":"IF(D11=\"\",\"Input I / IIa,b / III / IV\",\"\")","v":""},null,"CG",300,72600,4,null,null,"3.17.1-4","AMPW",50,7000,2]
["Location area (only loc. III)",null,"F/S/A",{"$f":"'Worksheet 11'!AE16","v":""},{"$f":"IF(D12=\"F\",\"\",IF(D12=\"S\",\"\",IF(D12=\"A\",\"\",IF(D11=\"III\",\"Input F / S / A\",\"\"))))","v":""},null,"AG",40,72600,4,{"$nulls":3},"CG",300,72600,4,{"$nulls":4},"F","Any","yes"]
["Design Category",null,"A/B/C/D",{"$f":"IF('Worksheet 11'!I16=\"\",\"\",'Worksheet 11'!I16)","v":{"v":0,"d":"0.00"}},{"$f":"IF(D13=\"\",\"Input A / B / C / D\",\"\")","v":""},null,"AMPW",50,7000,2,{"$nulls":3},"GRP M30",140,7500,2,{"$nulls":4},"S","M","no"]
["Craft Type Any/Motor/Sail",null,"Any/M/S",{"$f":"'Worksheet 11'!AE18","v":""},{"$f":"IF(D14=\"\",\"Input Any / M / S\",\"\")","v":"Input Any / M / S"},null,"GRP M30",140,7500,2,{"$nulls":3},"GRP M35",175,10000,2,{"$nulls":4},"A","S"]
["optional: craft length of hull",null,"m",{"$f":"'Worksheet 11'!I18","v":{"v":0,"d":"0.00"}},"default, change if smaller",null,"GRP M35",175,10000,2,{"$nulls":3},"MS",400,200000,2]
[{"$nulls":6},"AL 5038",280,70000,2,{"$nulls":3},"PC",90,2400,3.5]
["Material",null,"see Tab. F.1",{"$f":"'Worksheet 11'!I19","v":{"v":0,"d":"0.00"}},{"$f":"IF(D17=\"\",\"manual input requ\",\"\")","v":""},null,"MS",400,200000,2,{"$nulls":3},"PMMA",110,3000,3.5]
["  ultimate flexural strength","Sigma u",null,{"$f":"LOOKUP(D17,N8:N18,O8:O18)","v":{"$error":"#N/A"}},"falls nicht in F.1 ",null,"AISI 316 L",510,200000,2,{"$nulls":3},"TG",200,72600,4]
["  modulus of elasticity","E",null,{"$f":"LOOKUP(D17,N8:N18,P8:P18)","v":{"$error":"#N/A"}},"Werte manuell"]
["  safety factor","gamma",null,{"$f":"LOOKUP(D17,N8:N18,Q8:Q18)","v":{"$error":"#N/A"}},"eintragen"]
[]
["Results for non-stiffened plates"]
["press reduction factor",null,null,{"$f":"IF(D5=\"R\",1.102-0.0004*D7,IF(D5=\"C\",1.102-0.0004*D8))","v":false},"(7.5)"]
["              within limits 0,33 and 1,0","psi",null,{"$f":"IF(D23<0.33,0.33,IF(D23>1,1,D23))","v":{"v":1,"d":"1.000"}},"(7.5)"]
["basic design press","p","KPa",{"$f":"'basic design pressure 11'!G43","v":{"v":1,"d":"1.00"}},"(7.4)",null,"see work sheet \"basic design press\""]
["allowable flexural stress","Sigma a","MPa",{"$f":"D18/D20","v":{"$error":"#N/A"}},"(7.8)",null,"is actual plate a sandwich?",null,{"$f":"'Worksheet 11'!I23","v":0},null,null,{"$f":"IF(I26=\"YES\",\"the difference in thickness between any two glass plies must be less than or equal to 2 mm and the thickness of the plastic interlayer must be less than, or equal to 0,76 mm for these conditions !\",\"\")","v":""}]
["curvature coefficient","kc",null,{"$f":"IF(D5=\"C\",1-(D9/D8),1-(D9/D7))","v":{"$error":"#DIV/0!"}},"(7.6)",null,{"$f":"IF(I26=\"yes\", \"number of layers?\",\"\")","v":""},null,{"$f":"IF('Worksheet 11'!I24=\"\",\"\",'Worksheet 11'!I24)","v":0}]
["              a/b real  (valid ≤ 5)",null,null,{"$f":"IF(D5=\"C\",1,D6/D7)","v":{"$error":"#DIV/0!"}},"(7.3) Annex G.2"]
["              a/b corrected",null,null,{"$f":"IF(D28>5,5,D28)","v":{"$error":"#DIV/0!"}},"(7.3) Annex G.2"]
["plate aspect ratio coeff stress","kr",null,{"$f":"IF(D5=\"R\",IF(D10=\"SF\",(0.62165*D29^2-0.6473*D29+0.26481)/(D29^2-1.173*D29+0.97671),IF(D10=\"SS\",(0.69952*D29^2+0.02662*D29-0.0735)/(D29^2-0.7185*D29+1.98925),\"Fehler\")),IF(D5=\"C\",IF(D10=\"SF\",0.248,0.309),\"FALSCH\"))","v":"FALSCH"},"(7.3) Annex G.2",null,"actual plate Thickness",null,{"$f":"'Worksheet 11'!I25","v":0},"mm",null,{"$f":"IF(I26=\"yes\", \"=sum of all plies\",\"\")","v":""}]
["pate aspect ratio coeff deflection","kf",null,{"$f":"IF(D5=\"R\",IF(D10=\"SF\",(0.08052*D29^2-0.0272*D29-0.0019)/(D29^2-0.9275*D29+1.70018),IF(D10=\"SS\",(0.12915*D29^2+0.00868*D29-0.0293)/(D29^2-0.887*D29+2.3372),\"Fehler\")),IF(D5=\"C\",IF(D10=\"SF\",0.027,0.043)))","v":false},"(7.3) Annex G.2",null,"required plate thickness",null,{"$f":"IF(AND(I26=\"Yes\",I27=\"\"),\"please enter number of layers\",IF(AND(I26=\"Yes\",I27>2),1.5*MAX(D35:D37),IF(AND(I26=\"Yes\",I27=2),1.2*MAX(D35:D37),IF(I36=\"Yes\",MAX(D36:D37),MAX(D35:D37)))))","v":{"$error":"#DIV/0!"}}]
[{"$nulls":6},"requirements fulfilled?",null,{"$f":"IF(I30=\"\",\"\",IF(I30>=I31,\"PASS\",\"FAIL\"))","v":{"$error":"#DIV/0!"}}]
["Thickness (Stress)","tr","mm",{"$f":"IF(D5=\"C\",D8*D27*SQRT(D30*D24*D25/D26/1000),D7*D27*SQRT(D30*D24*D25/D26/1000))","v":{"$error":"#DIV/0!"}},"(7.1.1)"]
["Thickness (Deflection)","tf","mm",{"$f":"0.45*(D33+D7*D27*POWER((D31*D24*D25/0.02/D19/1000),0.33333))","v":{"$error":"#DIV/0!"}},"(7.1.2)"]
["Thickness",null,null,{"$f":"ROUND(MAX(D33:D34),2)","v":{"$error":"#DIV/0!"}},"(7.1.7)",{"$nulls":3},"Minimum tech used???"]
["Thickness minimu, techn. ",null,"mm",{"$f":"D35-0.5","v":{"$error":"#DIV/0!"}},null,null," = Minimum, absolute",null,{"$f":"Summary!P19","v":0}]
["Thickness minimum, Tab 5","tm","mm",{"$f":"'basic design pressure 11'!J48","v":{"v":0,"d":"0.0"}},"(Tab. 5)",null,"(only PMMA, PC, TG, LG)"]
[]
["Escape Hatch possible ?"]
["Required ISO 9094-1, 2"]
["Circular: inner Diam > 450 mm",null,null,{"$f":"IF(D5=\"C\",IF(D8>450,\"pass\",\"fail\"),\"n.a.\")","v":"n.a."}]
["Rectang: inner Diam > 380 mm",null,null,{"$f":"IF(D5=\"R\",IF(MAX(D6:D7)>380,\"pass\",\"fail\"),\"n.a.\")","v":"n.a."}]
["              Area > 180000 mm²",null,null,{"$f":"IF(D5=\"R\",IF(D6*D7>180000,\"pass\",\"fail\"),\"n.a.\")","v":"n.a."}]

{"sheet":"basic design pressure 11","index":36,"n_rows":193,"n_cols":10,"rows_kept":193,"hidden":true}
["Basic design pressure",null,null,"(7.4 Table 4)"]
[]
["location",null,{"$f":"'main Side windows 11'!D11","v":0}]
["particular",null,{"$f":"IF(AND(C5=\"C\",C6=\"M\",C3=\"III\"),\"A\",'main Side windows 11'!D12)","v":""},null,"Remark: f=front, s=side"]
["design cat",null,{"$f":"'main Side windows 11'!D13","v":0}]
["craft type",null,{"$f":"'main Side windows 11'!D14","v":""},{"$f":"IF(C6=\"Any\",\"S\",C6)","v":""},"Remark: if craft type = Any, set craft type = S"]
[]
[]
["Tabelle 4",null,"location","craft type","design cat","particular","pressure"]
[null,null,"I","Any","Any","Any",70]
[null,null,"IIB","Any","A","Any",70]
[null,null,"IIB","Any","B","Any",50]
[null,null,"IIB","Any","C","Any",28]
[null,null,"IIB","Any","D","Any",28]
[null,null,"IIA","Any","Any","Any",28]
[null,null,"III","S","A","Any",18]
[null,null,"III","S","B","Any",18]
[null,null,"III","S","C","Any",12]
[null,null,"III","S","D","Any",12]
[null,null,"III","M","A","Front",12]
[null,null,"III","M","A","Any",12]
[null,null,"III","M","B","Front",9]
[null,null,"III","M","B","Any",9]
[null,null,"III","M","D","Front",6,null,null,"Korrektur, Zeile eingefügt um Fehler bei eingabe III, M, Front, D zu beheben"]
[null,null,"III","M","A","Side",9]
[null,null,"III","M","B","Side",6]
[null,null,"III","M","C","Any",6]
[null,null,"III","M","D","Any",6]
[null,null,"IV","S","Any","Any",12]
[null,null,"IV","M","Any","Any",6]
[]
["Ergebnis"]
[null,"location = I",{"$nulls":4},{"$f":"IF(C3=\"I\",G10,0)","v":0}]
[null,"location = IIB",{"$nulls":4},{"$f":"IF(C3=\"IIB\",VLOOKUP(C5,E11:G15,3),0)","v":0}]
[null,"location = IIA",{"$nulls":4},{"$f":"IF(C3=\"IIA\",VLOOKUP(C3,E11:G15,3),0)","v":0}]
[null,"location = III","craft = S",{"$nulls":3},{"$f":"IF(AND(C3=\"III\",D6=\"S\"),VLOOKUP(C5,E16:G19,3),0)","v":0}]
[null,"location = III","craft = M","particular = front",null,null,{"$f":"IF(AND(C3=\"III\",D6=\"M\",C4=\"F\"),VLOOKUP(C5,E20:G24,3),0)","v":0}]
[null,"location = III","craft = M","particular = any",null,null,{"$f":"IF(AND(OR(C5=\"A\",C5=\"B\"),C3=\"III\",D6=\"M\",C4=\"A\"),VLOOKUP(C5,E20:G24,3),0)","v":0}]
[null,"location = III","craft = M","particular = side",null,null,{"$f":"IF(AND(C3=\"III\",C6=\"M\",C4=\"S\"),IF(C5=\"A\",9,IF(C5=\"B\",6,0)))","v":false}]
[null,"location = III","craft = M",{"$nulls":3},{"$f":"IF(C5=\"A\",0,IF(C5=\"B\",0,IF(AND(C3=\"III\",C6=\"M\"),VLOOKUP(C5,E27:G28,3))))","v":false}]
[null,"location = IV",{"$nulls":4},{"$f":"IF(C3=\"IV\",VLOOKUP(D6,D29:G30,4,0),1)","v":1}]
[]
["pressure",{"$nulls":5},{"$f":"MAX(G33:G41)","v":1}]
[]
[]
["minimum thickness"]
[]
[null,"Area",{"$f":"IF(OR('main Side windows 11'!D11=\"IIA\",'main Side windows 11'!D11=\"IIB\"),\"II\",'main Side windows 11'!D11)","v":0},{"$nulls":4},"minimum thickness",null,{"$f":"MAX(J50:J190)","v":0}]
[]
[null,null,"PMMA","A","I",{"$f":" IF('main Side windows 11'!$D$15>0,6 + 0.1*('main Side windows 11'!$D$15-4),\"\")","v":""},{"$nulls":3},{"$f":"IF('main Side windows 11'!$D$17=\"PMMA\",(IF('main Side windows 11'!$D$13=\"A\",VLOOKUP($C$48,$E$50:$F$53,2,-1),0)),0)","v":0}]
["Table 5",{"$nulls":3},"II",6]
[{"$nulls":4},"III",5]
[{"$nulls":4},"IV",5]
[null,null,"PMMA","B","I",{"$f":" IF('main Side windows 11'!$D$15>0,6 + 0.1*('main Side windows 11'!$D$15-4),\"\")","v":""},{"$nulls":3},{"$f":"IF('main Side windows 11'!$D$17=\"PMMA\",(IF('main Side windows 11'!$D$13=\"B\",VLOOKUP($C$48,$E$54:$F$57,2,-1),0)),0)","v":0}]
[{"$nulls":4},"II",6]
[{"$nulls":4},"III",5]
[{"$nulls":4},"IV",5]
[null,null,"PMMA","C","I",{"$f":" IF('main Side windows 11'!$D$15>0,6 + 0.1*('main Side windows 11'!$D$15-4),\"\")","v":""},{"$nulls":3},{"$f":"IF('main Side windows 11'!$D$17=\"PMMA\",(IF('main Side windows 11'!$D$13=\"C\",VLOOKUP($C$48,$E$58:$F$61,2,-1),0)),0)","v":0}]
[{"$nulls":4},"II",6]
[{"$nulls":4},"III",4]
[{"$nulls":4},"IV",4]
[null,null,"PMMA","D","I",{"$f":" IF('main Side windows 11'!$D$15>0,6 + 0.1*('main Side windows 11'!$D$15-4),\"\")","v":""},{"$nulls":3},{"$f":"IF('main Side windows 11'!$D$17=\"PMMA\",(IF('main Side windows 11'!$D$13=\"D\",VLOOKUP($C$48,E62:F65,2,-1),0)),0)","v":0}]
[{"$nulls":4},"II",6]
[{"$nulls":4},"III",4]
[{"$nulls":4},"IV",4]
[null,null,"PC","A","I",{"$f":" IF('main Side windows 11'!$D$15>0,6 + 0.1*('main Side windows 11'!$D$15-4),\"\")","v":""},{"$nulls":3},{"$f":"IF('main Side windows 11'!$D$17=\"PC\",(IF('main Side windows 11'!$D$13=\"A\",VLOOKUP($C$48,E66:F69,2,-1),0)),0)","v":0}]
[{"$nulls":4},"II",6]
[{"$nulls":4},"III",5]
[{"$nulls":4},"IV",5]
[null,null,"PC","B","I",{"$f":" IF('main Side windows 11'!$D$15>0,6 + 0.1*('main Side windows 11'!$D$15-4),\"\")","v":""},{"$nulls":3},{"$f":"IF('main Side windows 11'!$D$17=\"PC\",(IF('main Side windows 11'!$D$13=\"B\",VLOOKUP($C$48,E70:F73,2,-1),0)),0)","v":0}]
[{"$nulls":4},"II",6]
[{"$nulls":4},"III",5]
[{"$nulls":4},"IV",5]
[null,null,"PC","C","I",{"$f":" IF('main Side windows 11'!$D$15>0,6 + 0.1*('main Side windows 11'!$D$15-4),\"\")","v":""},{"$nulls":3},{"$f":"IF('main Side windows 11'!$D$17=\"PC\",(IF('main Side windows 11'!$D$13=\"C\",VLOOKUP($C$48,E74:F77,2,-1),0)),0)","v":0}]
[{"$nulls":4},"II",6]
[{"$nulls":4},"III",4]
[{"$nulls":4},"IV",4]
[null,null,"PC","D","I",{"$f":" IF('main Side windows 11'!$D$15>0,6 + 0.1*('main Side windows 11'!$D$15-4),\"\")","v":""},{"$nulls":3},{"$f":"IF('main Side windows 11'!$D$17=\"PC\",(IF('main Side windows 11'!$D$13=\"D\",VLOOKUP($C$48,E78:F81,2,-1),0)),0)","v":0}]
[{"$nulls":4},"II",6]
[{"$nulls":4},"III",4]
[{"$nulls":4},"IV",4]
[null,null,"TG","A","I",{"$f":" IF('main Side windows 11'!$D$15>0,5+ 0.1*('main Side windows 11'!$D$15-4),\"\")","v":""},{"$nulls":3},{"$f":"IF('main Side windows 11'!$D$17=\"TG\",(IF('main Side windows 11'!$D$13=\"A\",VLOOKUP($C$48,E82:F85,2,-1),0)),0)","v":0}]
[{"$nulls":4},"II",4]
[{"$nulls":4},"III",4]
[{"$nulls":4},"IV",4]
[null,null,"TG","B","I",{"$f":" IF('main Side windows 11'!$D$15>0,5+ 0.1*('main Side windows 11'!$D$15-4),\"\")","v":""},{"$nulls":3},{"$f":"IF('main Side windows 11'!$D$17=\"TG\",(IF('main Side windows 11'!$D$13=\"B\",VLOOKUP($C$48,E86:F89,2,-1),0)),0)","v":0}]
[{"$nulls":4},"II",4]
[{"$nulls":4},"III",4]
[{"$nulls":4},"IV",4]
[null,null,"TG","C","I",{"$f":" IF('main Side windows 11'!$D$15>0,5+ 0.1*('main Side windows 11'!$D$15-4),\"\")","v":""},{"$nulls":3},{"$f":"IF('main Side windows 11'!$D$17=\"TG\",(IF('main Side windows 11'!$D$13=\"C\",VLOOKUP($C$48,E90:F93,2,-1),0)),0)","v":0}]
[{"$nulls":4},"II",4]
[{"$nulls":4},"III",3]
[{"$nulls":4},"IV",3]
[null,null,"TG","D","I",{"$f":" IF('main Side windows 11'!$D$15>0,5+ 0.1*('main Side windows 11'!$D$15-4),\"\")","v":""},{"$nulls":3},{"$f":"IF('main Side windows 11'!$D$17=\"TG\",(IF('main Side windows 11'!$D$13=\"D\",VLOOKUP($C$48,E94:F97,2,-1),0)),0)","v":0}]
[{"$nulls":4},"II",4]
[{"$nulls":4},"III",3]
[{"$nulls":4},"IV",3]
[null,null,"LG","A","I",{"$f":" IF('main Side windows 11'!$D$15>0,5+ 0.1*('main Side windows 11'!$D$15-4),\"\")","v":""},{"$nulls":3},{"$f":"IF('main Side windows 11'!$D$17=\"LG\",(IF('main Side windows 11'!$D$13=\"A\",VLOOKUP($C$48,E98:F101,2,-1),0)),0)","v":0}]
[{"$nulls":4},"II",4]
[{"$nulls":4},"III",4]
[{"$nulls":4},"IV",4]
[null,null,"LG","B","I",{"$f":" IF('main Side windows 11'!$D$15>0,5+ 0.1*('main Side windows 11'!$D$15-4),\"\")","v":""},{"$nulls":3},{"$f":"IF('main Side windows 11'!$D$17=\"LG\",(IF('main Side windows 11'!$D$13=\"B\",VLOOKUP($C$48,E102:F105,2,-1),0)),0)","v":0}]
[{"$nulls":4},"II",4]
[{"$nulls":4},"III",4]
[{"$nulls":4},"IV",4]
[null,null,"LG","C","I",{"$f":" IF('main Side windows 11'!$D$15>0,5+ 0.1*('main Side windows 11'!$D$15-4),\"\")","v":""},{"$nulls":3},{"$f":"IF('main Side windows 11'!$D$17=\"LG\",(IF('main Side windows 11'!$D$13=\"C\",VLOOKUP($C$48,E106:F109,2,-1),0)),0)","v":0}]
[{"$nulls":4},"II",4]
[{"$nulls":4},"III",3]
[{"$nulls":4},"IV",3]
[null,null,"LG","D","I",{"$f":" IF('main Side windows 11'!$D$15>0,5+ 0.1*('main Side windows 11'!$D$15-4),\"\")","v":""},{"$nulls":3},{"$f":"IF('main Side windows 11'!$D$17=\"LG\",(IF('main Side windows 11'!$D$13=\"D\",VLOOKUP($C$48,E110:F113,2,-1),0)),0)","v":0}]
[{"$nulls":4},"II",4]
[{"$nulls":4},"III",3]
[{"$nulls":4},"IV",3]
[null,null,"AMPW","A","I",{"$f":" IF('main Side windows 11'!$D$15>0,8+ 0.1*('main Side windows 11'!$D$15-4),\"\")","v":""},{"$nulls":3},{"$f":"IF('main Side windows 11'!$D$17=\"AMPW\",(IF('main Side windows 11'!$D$13=\"A\",VLOOKUP($C$48,E114:F117,2,-1),0)),0)","v":0}]
[{"$nulls":4},"II",6]
[{"$nulls":4},"III",5]
[{"$nulls":4},"IV",5]
[null,null,"AMPW","B","I",{"$f":" IF('main Side windows 11'!$D$15>0,8+ 0.1*('main Side windows 11'!$D$15-4),\"\")","v":""},{"$nulls":3},{"$f":"IF('main Side windows 11'!$D$17=\"AMPW\",(IF('main Side windows 11'!$D$13=\"B\",VLOOKUP($C$48,E118:F121,2,-1),0)),0)","v":0}]
[{"$nulls":4},"II",6]
[{"$nulls":4},"III",5]
[{"$nulls":4},"IV",5]
[null,null,"AMPW","C","I",{"$f":" IF('main Side windows 11'!$D$15>0,8+ 0.1*('main Side windows 11'!$D$15-4),\"\")","v":""},{"$nulls":3},{"$f":"IF('main Side windows 11'!$D$17=\"AMPW\",(IF('main Side windows 11'!$D$13=\"C\",VLOOKUP($C$48,E122:F125,2,-1),0)),0)","v":0}]
[{"$nulls":4},"II",6]
[{"$nulls":4},"III",4]
[{"$nulls":4},"IV",4]
[null,null,"AMPW","D","I",{"$f":" IF('main Side windows 11'!$D$15>0,8+ 0.1*('main Side windows 11'!$D$15-4),\"\")","v":""},{"$nulls":3},{"$f":"IF('main Side windows 11'!$D$17=\"AMPW\",(IF('main Side windows 11'!$D$13=\"D\",VLOOKUP($C$48,E126:F129,2,-1),0)),0)","v":0}]
[{"$nulls":4},"II",6]
[{"$nulls":4},"III",4]
[{"$nulls":4},"IV",4]
[null,null,"GRP m30","A","I",{"$f":" IF('main Side windows 11'!$D$15>0,4 + 0.1*('main Side windows 11'!$D$15-4),\"\")","v":""},{"$nulls":3},{"$f":"IF('main Side windows 11'!$D$17=\"GRP M30\",(IF('main Side windows 11'!$D$13=\"A\",VLOOKUP($C$48,E130:F133,2,-1),0)),0)","v":0}]
[{"$nulls":4},"II",3]
[{"$nulls":4},"III",3]
[{"$nulls":4},"IV",3]
[null,null,"GRP m30","B","I",{"$f":" IF('main Side windows 11'!$D$15>0,4 + 0.1*('main Side windows 11'!$D$15-4),\"\")","v":""},{"$nulls":3},{"$f":"IF('main Side windows 11'!$D$17=\"GRP M30\",(IF('main Side windows 11'!$D$13=\"B\",VLOOKUP($C$48,E134:F137,2,-1),0)),0)","v":0}]
[{"$nulls":4},"II",3]
[{"$nulls":4},"III",3]
[{"$nulls":4},"IV",3]
[null,null,"GRP m30","C","I",{"$f":" IF('main Side windows 11'!$D$15>0,4 + 0.1*('main Side windows 11'!$D$15-4),\"\")","v":""},{"$nulls":3},{"$f":"IF('main Side windows 11'!$D$17=\"GRP M30\",(IF('main Side windows 11'!$D$13=\"C\",VLOOKUP($C$48,E138:F141,2,-1),0)),0)","v":0}]
[{"$nulls":4},"II",3]
[{"$nulls":4},"III",2]
[{"$nulls":4},"IV",2]
[null,null,"GRP m30","D","I",{"$f":" IF('main Side windows 11'!$D$15>0,4 + 0.1*('main Side windows 11'!$D$15-4),\"\")","v":""},{"$nulls":3},{"$f":"IF('main Side windows 11'!$D$17=\"GRP M30\",(IF('main Side windows 11'!$D$13=\"D\",VLOOKUP($C$48,E142:F145,2,-1),0)),0)","v":0}]
[{"$nulls":4},"II",3]
[{"$nulls":4},"III",2]
[{"$nulls":4},"IV",2]
[null,null,"GRP m35","A","I",{"$f":" IF('main Side windows 11'!$D$15>0,4 + 0.1*('main Side windows 11'!$D$15-4),\"\")","v":""},{"$nulls":3},{"$f":"IF('main Side windows 11'!$D$17=\"GRP M35\",(IF('main Side windows 11'!$D$13=\"A\",VLOOKUP($C$48,E146:F149,2,-1),0)),0)","v":0}]
[{"$nulls":4},"II",3]
[{"$nulls":4},"III",3]
[{"$nulls":4},"IV",3]
[null,null,"GRP m35","B","I",{"$f":" IF('main Side windows 11'!$D$15>0,4 + 0.1*('main Side windows 11'!$D$15-4),\"\")","v":""},{"$nulls":3},{"$f":"IF('main Side windows 11'!$D$17=\"GRP M35\",(IF('main Side windows 11'!$D$13=\"B\",VLOOKUP($C$48,E150:F153,2,-1),0)),0)","v":0}]
[{"$nulls":4},"II",3]
[{"$nulls":4},"III",3]
[{"$nulls":4},"IV",3]
[null,null,"GRP m35","C","I",{"$f":" IF('main Side windows 11'!$D$15>0,4 + 0.1*('main Side windows 11'!$D$15-4),\"\")","v":""},{"$nulls":3},{"$f":"IF('main Side windows 11'!$D$17=\"GRP M35\",(IF('main Side windows 11'!$D$13=\"C\",VLOOKUP($C$48,E154:F157,2,-1),0)),0)","v":0}]
[{"$nulls":4},"II",3]
[{"$nulls":4},"III",2]
[{"$nulls":4},"IV",2]
[null,null,"GRP m35","D","I",{"$f":" IF('main Side windows 11'!$D$15>0,4 + 0.1*('main Side windows 11'!$D$15-4),\"\")","v":""},{"$nulls":3},{"$f":"IF('main Side windows 11'!$D$17=\"GRP M35\",(IF('main Side windows 11'!$D$13=\"D\",VLOOKUP($C$48,E158:F161,2,-1),0)),0)","v":0}]
[{"$nulls":4},"II",3]
[{"$nulls":4},"III",2]
[{"$nulls":4},"IV",2]
[null,null,"Al 5038","A","I",{"$f":" IF('main Side windows 11'!$D$15>0,3 + 0.05*('main Side windows 11'!$D$15-4),\"\")","v":""},{"$nulls":3},{"$f":"IF('main Side windows 11'!$D$17=\"Al 5038\",(IF('main Side windows 11'!$D$13=\"A\",VLOOKUP($C$48,E162:F165,2,-1),0)),0)","v":0}]
[{"$nulls":4},"II",3]
[{"$nulls":4},"III",3]
[{"$nulls":4},"IV",3]
[null,null,"Al 5038","B","I",{"$f":" IF('main Side windows 11'!$D$15>0,3 + 0.05*('main Side windows 11'!$D$15-4),\"\")","v":""},{"$nulls":3},{"$f":"IF('main Side windows 11'!$D$17=\"AL 5038\",(IF('main Side windows 11'!$D$13=\"B\",VLOOKUP($C$48,E166:F169,2,-1),0)),0)","v":0}]
[{"$nulls":4},"II",3]
[{"$nulls":4},"III",3]
[{"$nulls":4},"IV",3]
[null,null,"Al 5038","C","I",{"$f":" IF('main Side windows 11'!$D$15>0,3 + 0.05*('main Side windows 11'!$D$15-4),\"\")","v":""},{"$nulls":3},{"$f":"IF('main Side windows 11'!$D$17=\"AL 5038\",(IF('main Side windows 11'!$D$13=\"C\",VLOOKUP($C$48,E170:F173,2,-1),0)),0)","v":0}]
[{"$nulls":4},"II",3]
[{"$nulls":4},"III",2]
[{"$nulls":4},"IV",2]
[null,null,"Al 5038","D","I",{"$f":" IF('main Side windows 11'!$D$15>0,3 + 0.05*('main Side windows 11'!$D$15-4),\"\")","v":""},{"$nulls":3},{"$f":"IF('main Side windows 11'!$D$17=\"AL 5038\",(IF('main Side windows 11'!$D$13=\"D\",VLOOKUP($C$48,E174:F177,2,-1),0)),0)","v":0}]
[{"$nulls":4},"II",3]
[{"$nulls":4},"III",2]
[{"$nulls":4},"IV",2]
[null,null,"MS","A","I",{"$f":" IF('main Side windows 11'!$D$15>0,2.5 + 0.025*('main Side windows 11'!$D$15-4),\"\")","v":""},{"$nulls":3},{"$f":"IF('main Side windows 11'!$D$17=\"MS\",(IF('main Side windows 11'!$D$13=\"A\",VLOOKUP($C$48,E178:F181,2,-1),0)),0)","v":0}]
[{"$nulls":4},"II",2.5]
[{"$nulls":4},"III",2.5]
[{"$nulls":4},"IV",2.5]
[null,null,"MS","B","I",{"$f":" IF('main Side windows 11'!$D$15>0,2.5 + 0.025*('main Side windows 11'!$D$15-4),\"\")","v":""},{"$nulls":3},{"$f":"IF('main Side windows 11'!$D$17=\"MS\",(IF('main Side windows 11'!$D$13=\"B\",VLOOKUP($C$48,E182:F185,2,-1),0)),0)","v":0}]
[{"$nulls":4},"II",2.5]
[{"$nulls":4},"III",2.5]
[{"$nulls":4},"IV",2.5]
[null,null,"MS","C","I",{"$f":" IF('main Side windows 11'!$D$15>0,2.5 + 0.025*('main Side windows 11'!$D$15-4),\"\")","v":""},{"$nulls":3},{"$f":"IF('main Side windows 11'!$D$17=\"MS\",(IF('main Side windows 11'!$D$13=\"C\",VLOOKUP($C$48,E186:F189,2,-1),0)),0)","v":0}]
[{"$nulls":4},"II",2.5]
[{"$nulls":4},"III",2]
[{"$nulls":4},"IV",2]
[null,null,"MS","D","I",{"$f":" IF('main Side windows 11'!$D$15>0,2.5 + 0.025*('main Side windows 11'!$D$15-4),\"\")","v":""},{"$nulls":3},{"$f":"IF('main Side windows 11'!$D$17=\"MS\",(IF('main Side windows 11'!$D$13=\"D\",VLOOKUP($C$48,E190:F193,2,-1),0)),0)","v":0}]
[{"$nulls":4},"II",2.5]
[{"$nulls":4},"III",2]
[{"$nulls":4},"IV",2]

{"sheet":"Worksheet 12","index":37,"n_rows":45,"n_cols":31,"rows_kept":45,"merged":[[0,0,0,9],[0,11,0,12],[1,0,1,9],[2,0,2,9],[4,0,4,9],[6,0,6,5],[17,13,17,14],[19,13,19,14],[21,12,21,14],[22,15,26,18],[27,6,28,6],[27,7,28,7],[27,15,27,21],[29,15,32,15],[29,16,32,16],[29,17,32,17],[29,18,29,21],[30,18,30,21],[31,18,31,19],[32,11,32,13],[34,13,34,14],[36,13,36,14],[38,13,38,14],[39,13,39,14],[41,13,41,14]]}
[{"$nulls":11},"Comments"]
["ISO 12216:2020 - Small craft - Windows, portlights, hatches, deadlights and doors",{"$nulls":11},"Derived values"]
["WORKSHEET No. 1 data entry",{"$nulls":11},"Input values"]
[]
[{"$f":"CONCATENATE(coverSheet!B5,\"   \",coverSheet!B12,\"   \",Summary!B20)","v":"      "}]
[]
["Parameter",{"$nulls":5},"Symbol","Unit","Value","Ref.",{"$nulls":5},"Material Properties see table F.1 and Tab. 5",{"$nulls":11},"List"]
["Form of plate (Rectangular / Circle)",{"$nulls":5},"R / C",null,{"$f":"Summary!C20","v":0},"Annex C",{"$nulls":5},"Table F.1 mechanical properties [MPa]",null,null,"Tab. 5",{"$nulls":8},"Lists"]
["Long side",{"$nulls":5},"a","mm",{"$f":"Summary!D20","v":0},"7.3, Annex C",{"$nulls":5},"Material","strength","elasticity","safety",{"$nulls":7},"rectangular","R","I","A",{"$f":"IF(I8=\"rectangular\",\"R\",IF(I8=\"circle\",\"C\",\"\"))","v":""}]
["Unsupported short side",{"$nulls":5},"b","mm",{"$f":"Summary!E20","v":0},"7.3, Annex C",{"$nulls":5},"PMMA",110,3000,3.5,{"$nulls":7},"circle","C","IIa","B"]
["Diameter",{"$nulls":5},"d","mm",{"$f":"Summary!F20","v":0},"7.3, Annex C",{"$nulls":5},"PC",90,2400,3.5,{"$nulls":9},"IIb","C"]
["Curve height",{"$nulls":5},"c","mm",{"$f":"Summary!G20","v":0},"7.6",{"$nulls":5},"TG",200,72600,4,{"$nulls":9},"III","D"]
["Support SemiFixed / Simply Supported",{"$nulls":5},"SF / SS",null,{"$f":"Summary!H20","v":0},"3.18",{"$nulls":5},"CG",300,72600,4,{"$nulls":7},"semi-fixed","SF","IV",null,{"$f":"IF(I13=\"semi-fixed\",\"SF\",IF(I13=\"\",\"\",\"SS\"))","v":"SS"}]
["Location type",{"$nulls":5},"I/IIA/IIB/III/IV",null,{"$f":"Summary!I20","v":0},"3.17; Annex A",{"$nulls":5},"AG",40,72600,4,{"$nulls":7},"simply supported","SS"]
["Location area (only loc. III)",{"$nulls":5},"F / S / Any",null,{"$f":"Summary!J20","v":0},"3.17.4",{"$nulls":5},"AMPW",50,7000,2]
["Design Category",{"$nulls":5},"A / B / C / D",null,{"$f":"Summary!K20","v":0},"3.12",{"$nulls":5},"GRP M30",140,7500,2,{"$nulls":6},"any","front","F","Any","yes",{"$f":"IF(I15=\"front\",\"F\",IF(I15=\"side\",\"S\",IF(I15=\"any\",\"A\",\"\")))","v":""}]
["Craft Type Any/Motor/Sail",{"$nulls":5},"Any / M / S",null,{"$f":"Summary!L20","v":0},{"$nulls":6},"GRP M35",175,10000,2,{"$nulls":6},"motor","side","S","M","no"]
["Length of hull as in ISO 8666",{"$nulls":5},"LH","m",{"$f":"Summary!N20","v":{"v":0,"d":"0.00"}},"3.16",{"$nulls":5},"AL 5038",280,70000,2,{"$nulls":6},"sail","any","Any","S",null,{"$f":"IF(I17=\"any\",\"Any\",IF(I17=\"motor\",\"M\",IF(I17=\"sail\",\"S\",\"\")))","v":""}]
["Material data",{"$nulls":7},{"$f":"Summary!O20","v":0},"Table F.1 & 5",{"$nulls":5},"MS",400,200000,2]
[null,"  Ultimate flexural strength",{"$nulls":4},"σU","MPa",{"$f":"'main Side windows 12'!D18","v":{"$error":"#N/A"}},"Table F.1 & 5",{"$nulls":5},"AISI 316 L",510,200000,2]
[null,"  Modulus of elasticity",{"$nulls":4},"E","MPa",{"$f":"'main Side windows 12'!D19","v":{"$error":"#N/A"}},"Table F.1 & 5"]
[null,"  Safety factor",{"$nulls":4},"gamma",". / .",{"$f":"'main Side windows 12'!D20","v":{"$error":"#N/A"}},"Table F.1 & 5",{"$nulls":15},"yes"]
["Is actual plate a sandwich?",{"$nulls":5},"yes / no",null,{"$f":"Summary!Q20","v":0},"7.9",{"$nulls":5},{"$f":"IF(I23=\"YES\",\"The difference in thickness between any two glass plies must be less than or equal to 2 mm and the thickness of the plastic interlayer must be less than, or equal to 0,76 mm for these conditions !\",\"\")","v":""},{"$nulls":9},"no"]
[null,"If yes, enter number of layers",{"$nulls":5},". / .",{"$f":"Summary!R20","v":0},"7.9"]
["Actual plate thickness (in case of sandwich the sum of all layers)",{"$nulls":6},"mm",{"$f":"Summary!U20","v":{"v":0,"d":"0.00"}}]
[]
["Results for non-stiffened plates"]
["Press reduction factor",{"$nulls":5},"Ψ",". / .",{"$f":"'main Side windows 12'!D23","v":false},"7.5"]
["              within limits 0,33 and 1,0",{"$nulls":7},{"$f":"'main Side windows 12'!D24","v":1},"7.5",{"$nulls":5},"Table 5 — Safety factor and minimum thickness of monolithic plates"]
["Basic design press",{"$nulls":5},"p","kPa",{"$f":"'main Side windows 12'!D25","v":1},"7.4",{"$nulls":5},"Material","Acronym","Safety factor\n γ ","Minimum thickness of monolithic plates, tm"]
["Allowable flexural stress",{"$nulls":5},"σa","MPa",{"$f":"'main Side windows 12'!D26","v":{"$error":"#N/A"}},"7.8",{"$nulls":8},"Design categories "]
["Curvature coefficient",{"$nulls":5},"kC",". / .",{"$f":"'main Side windows 12'!D27","v":{"$error":"#DIV/0!"}},"7.6",{"$nulls":8},"Any",null,"A & B","C & D"]
["Ratio a/b (valid ≤ 5)",{"$nulls":6},". / .",{"$f":"'main Side windows 12'!D28","v":{"$error":"#DIV/0!"}},"7.3, Annex G.2",{"$nulls":8},"Area Ia","Area II","Area III & IV","Area III & IV"]
["Ratio a/b corrected",{"$nulls":6},". / .",{"$f":"'main Side windows 12'!D29","v":{"$error":"#DIV/0!"}},"7.3, Annex G.2",{"$nulls":5},"Poly(methyl)methacrylate","PMMA",3.5,"6+0,1(LH-4)",6,5,4]
["Plate aspect ratio coeff stress",{"$nulls":5},"kr",". / .",{"$f":"'main Side windows 12'!D30","v":"FALSCH"},"7.3, Annex G.2",{"$nulls":5},"Polycarbonate","PC",3.5,"6+0,1(LH-4)",6,5,4]
["Pate aspect ratio coeff deflection",{"$nulls":5},"kf",". / .",{"$f":"'main Side windows 12'!D31","v":false},"7.3, Annex G.2",{"$nulls":5},"Monolithic tempered glass ","TG",4,"5+0,1(LH-4)b",4,4,3]
[{"$nulls":15},"Laminated glass ","LG",4,"5+0,1(LH-4)b",4,4,3]
["Thickness (Stress)",{"$nulls":5},"tr","mm",{"$f":"'main Side windows 12'!D33","v":{"$error":"#DIV/0!"}},"7.1.1",{"$nulls":5},"All mahogany plywood ","AMPW",2,"8+0,1(LH-4)",6,5,4]
["Thickness (Deflection)",{"$nulls":5},"tf","mm",{"$f":"'main Side windows 12'!D34","v":{"$error":"#DIV/0!"}},"7.1.2",{"$nulls":5},"GRP mat 30 % glass ","GRP M30",2,"4+0,1(LH-4)",3,3,2]
["Thickness",{"$nulls":6},"mm",{"$f":"'main Side windows 12'!D35","v":{"$error":"#DIV/0!"}},{"$nulls":6},"GRP mat/roving 35 % glass ","GRP M35",2,"4+0,1(LH-4)",3,3,2]
["Thickness minimu, techn. ",{"$nulls":5},"tm","mm",{"$f":"'main Side windows 12'!D36","v":{"$error":"#DIV/0!"}},"7.8",{"$nulls":5},"Aluminium alloy 5083-H111 ","AL 5038",2,"3+0,05 (LH-4)",3,3,2]
["Thickness minimum, Tab 5",{"$nulls":6},"mm",{"$f":"'main Side windows 12'!D37","v":{"v":0,"d":"0.0"}},"Table 5",{"$nulls":5},"Mild steel ","MS",2,"2,5+0,025 (LH-4)",2.5,2.5,2]
[]
["Required plate thickness",{"$nulls":6},"mm",{"$f":"'main Side windows 12'!I31","v":{"$error":"#DIV/0!"}}]
["Requirements fullfilled?",{"$nulls":7},{"$f":"IF(L13=\"short side in area I max 300mm\",\"FAIL\",IF(I25>=I44,\"PASS\",\"FAIL\"))","v":{"$error":"#DIV/0!"}}]

{"sheet":"main Side windows 12","index":38,"n_rows":43,"n_cols":24,"rows_kept":43,"hidden":true,"merged":[[0,0,0,5],[1,0,1,5],[25,11,28,18],[26,6,26,7]]}
[{"$nulls":6},"manufacturer"]
[{"$nulls":6},"model name"]
["Eingabe","Version 1.2.2 / 15-03-2006 rev 060512/070507/dew 090918",{"$nulls":4},"ISO/FDIS 12216:2002(E)"]
["Parameter Input","SSign","Item/Unit",{"$nulls":18},"Lists"]
["form of plate Rectangular/Circle",null,"R/C",{"$f":"'Worksheet 12'!AE9","v":""},{"$f":"IF(D5=\"\",\"Input R oder C\",\"\")","v":"Input R oder C"},null,"Material Properties see table F.1 and Tab. 5",{"$nulls":14},"R","I","A"]
["long side","a","mm",{"$f":"'Worksheet 12'!I9","v":0},{"$f":"IF(AND(D5=\"R\",D6=\"\"),\"Input a requested\",IF(AND(D5=\"C\",D6=\"\"),\"Input d requested\",\"\"))","v":""},null,"Table F.1 mechanical properties [Mpa]",null,null,"Tab. 5",{"$nulls":11},"C","IIa","B"]
["unsupported short side","b","mm",{"$f":"'Worksheet 12'!I10","v":0},{"$f":"IF(AND(D5=\"R\",D7=\"\"),\"Input b requested\",IF(AND(D5=\"C\",D7=\"\"),\"Input d requested\",\"\"))","v":""},null,"Material","strength","elasticity","safety",{"$nulls":12},"IIb","C"]
["diameter","d","mm",{"$f":"'Worksheet 12'!I11","v":0},{"$f":"IF(AND(D5=\"C\",D8=\"\"),\"Input d requested\",\"\")","v":""},null,"PMMA",110,3000,3.5,{"$nulls":3},"AG",40,72600,4,{"$nulls":5},"III","D"]
["curve height","c","mm",{"$f":"'Worksheet 12'!I12","v":0},"optional",null,"PC",90,2400,3.5,{"$nulls":3},"AISI 316 L",510,200000,2,{"$nulls":4},"SF","IV"]
["support SemiFixed/Simple Supp.",null,"SF/SS",{"$f":"'Worksheet 12'!AE13","v":"SS"},{"$f":"IF(D10=\"\",\"Input SF or SS\",\"\")","v":""},null,"TG",200,72600,4,null,null,"6.1","AL 5038",280,70000,2,{"$nulls":4},"SS"]
["Location type",null,"I/IIA/IIB/III/IV",{"$f":"'Worksheet 12'!I14","v":{"v":0,"d":"0.00"}},{"$f":"IF(D11=\"\",\"Input I / IIa,b / III / IV\",\"\")","v":""},null,"CG",300,72600,4,null,null,"3.17.1-4","AMPW",50,7000,2]
["Location area (only loc. III)",null,"F/S/A",{"$f":"'Worksheet 12'!AE16","v":""},{"$f":"IF(D12=\"F\",\"\",IF(D12=\"S\",\"\",IF(D12=\"A\",\"\",IF(D11=\"III\",\"Input F / S / A\",\"\"))))","v":""},null,"AG",40,72600,4,{"$nulls":3},"CG",300,72600,4,{"$nulls":4},"F","Any","yes"]
["Design Category",null,"A/B/C/D",{"$f":"IF('Worksheet 12'!I16=\"\",\"\",'Worksheet 12'!I16)","v":{"v":0,"d":"0.00"}},{"$f":"IF(D13=\"\",\"Input A / B / C / D\",\"\")","v":""},null,"AMPW",50,7000,2,{"$nulls":3},"GRP M30",140,7500,2,{"$nulls":4},"S","M","no"]
["Craft Type Any/Motor/Sail",null,"Any/M/S",{"$f":"'Worksheet 12'!AE18","v":""},{"$f":"IF(D14=\"\",\"Input Any / M / S\",\"\")","v":"Input Any / M / S"},null,"GRP M30",140,7500,2,{"$nulls":3},"GRP M35",175,10000,2,{"$nulls":4},"A","S"]
["optional: craft length of hull",null,"m",{"$f":"'Worksheet 12'!I18","v":{"v":0,"d":"0.00"}},"default, change if smaller",null,"GRP M35",175,10000,2,{"$nulls":3},"MS",400,200000,2]
[{"$nulls":6},"AL 5038",280,70000,2,{"$nulls":3},"PC",90,2400,3.5]
["Material",null,"see Tab. F.1",{"$f":"'Worksheet 12'!I19","v":{"v":0,"d":"0.00"}},{"$f":"IF(D17=\"\",\"manual input requ\",\"\")","v":""},null,"MS",400,200000,2,{"$nulls":3},"PMMA",110,3000,3.5]
["  ultimate flexural strength","Sigma u",null,{"$f":"LOOKUP(D17,N8:N18,O8:O18)","v":{"$error":"#N/A"}},"falls nicht in F.1 ",null,"AISI 316 L",510,200000,2,{"$nulls":3},"TG",200,72600,4]
["  modulus of elasticity","E",null,{"$f":"LOOKUP(D17,N8:N18,P8:P18)","v":{"$error":"#N/A"}},"Werte manuell"]
["  safety factor","gamma",null,{"$f":"LOOKUP(D17,N8:N18,Q8:Q18)","v":{"$error":"#N/A"}},"eintragen"]
[]
["Results for non-stiffened plates"]
["press reduction factor",null,null,{"$f":"IF(D5=\"R\",1.102-0.0004*D7,IF(D5=\"C\",1.102-0.0004*D8))","v":false},"(7.5)"]
["              within limits 0,33 and 1,0","psi",null,{"$f":"IF(D23<0.33,0.33,IF(D23>1,1,D23))","v":{"v":1,"d":"1.000"}},"(7.5)"]
["basic design press","p","KPa",{"$f":"'basic design pressure 12'!G43","v":{"v":1,"d":"1.00"}},"(7.4)",null,"see work sheet \"basic design press\""]
["allowable flexural stress","Sigma a","MPa",{"$f":"D18/D20","v":{"$error":"#N/A"}},"(7.8)",null,"is actual plate a sandwich?",null,{"$f":"'Worksheet 12'!I23","v":0},null,null,{"$f":"IF(I26=\"YES\",\"the difference in thickness between any two glass plies must be less than or equal to 2 mm and the thickness of the plastic interlayer must be less than, or equal to 0,76 mm for these conditions !\",\"\")","v":""}]
["curvature coefficient","kc",null,{"$f":"IF(D5=\"C\",1-(D9/D8),1-(D9/D7))","v":{"$error":"#DIV/0!"}},"(7.6)",null,{"$f":"IF(I26=\"yes\", \"number of layers?\",\"\")","v":""},null,{"$f":"IF('Worksheet 12'!I24=\"\",\"\",'Worksheet 12'!I24)","v":0}]
["              a/b real  (valid ≤ 5)",null,null,{"$f":"IF(D5=\"C\",1,D6/D7)","v":{"$error":"#DIV/0!"}},"(7.3) Annex G.2"]
["              a/b corrected",null,null,{"$f":"IF(D28>5,5,D28)","v":{"$error":"#DIV/0!"}},"(7.3) Annex G.2"]
["plate aspect ratio coeff stress","kr",null,{"$f":"IF(D5=\"R\",IF(D10=\"SF\",(0.62165*D29^2-0.6473*D29+0.26481)/(D29^2-1.173*D29+0.97671),IF(D10=\"SS\",(0.69952*D29^2+0.02662*D29-0.0735)/(D29^2-0.7185*D29+1.98925),\"Fehler\")),IF(D5=\"C\",IF(D10=\"SF\",0.248,0.309),\"FALSCH\"))","v":"FALSCH"},"(7.3) Annex G.2",null,"actual plate Thickness",null,{"$f":"'Worksheet 12'!I25","v":0},"mm",null,{"$f":"IF(I26=\"yes\", \"=sum of all plies\",\"\")","v":""}]
["pate aspect ratio coeff deflection","kf",null,{"$f":"IF(D5=\"R\",IF(D10=\"SF\",(0.08052*D29^2-0.0272*D29-0.0019)/(D29^2-0.9275*D29+1.70018),IF(D10=\"SS\",(0.12915*D29^2+0.00868*D29-0.0293)/(D29^2-0.887*D29+2.3372),\"Fehler\")),IF(D5=\"C\",IF(D10=\"SF\",0.027,0.043)))","v":false},"(7.3) Annex G.2",null,"required plate thickness",null,{"$f":"IF(AND(I26=\"Yes\",I27=\"\"),\"please enter number of layers\",IF(AND(I26=\"Yes\",I27>2),1.5*MAX(D35:D37),IF(AND(I26=\"Yes\",I27=2),1.2*MAX(D35:D37),IF(I36=\"Yes\",MAX(D36:D37),MAX(D35:D37)))))","v":{"$error":"#DIV/0!"}}]
[{"$nulls":6},"requirements fulfilled?",null,{"$f":"IF(I30=\"\",\"\",IF(I30>=I31,\"PASS\",\"FAIL\"))","v":{"$error":"#DIV/0!"}}]
["Thickness (Stress)","tr","mm",{"$f":"IF(D5=\"C\",D8*D27*SQRT(D30*D24*D25/D26/1000),D7*D27*SQRT(D30*D24*D25/D26/1000))","v":{"$error":"#DIV/0!"}},"(7.1.1)"]
["Thickness (Deflection)","tf","mm",{"$f":"0.45*(D33+D7*D27*POWER((D31*D24*D25/0.02/D19/1000),0.33333))","v":{"$error":"#DIV/0!"}},"(7.1.2)"]
["Thickness",null,null,{"$f":"ROUND(MAX(D33:D34),2)","v":{"$error":"#DIV/0!"}},"(7.1.7)",{"$nulls":3},"Minimum tech used???"]
["Thickness minimu, techn. ",null,"mm",{"$f":"D35-0.5","v":{"$error":"#DIV/0!"}},null,null," = Minimum, absolute",null,{"$f":"Summary!P20","v":0}]
["Thickness minimum, Tab 5","tm","mm",{"$f":"'basic design pressure 12'!J48","v":{"v":0,"d":"0.0"}},"(Tab. 5)",null,"(only PMMA, PC, TG, LG)"]
[]
["Escape Hatch possible ?"]
["Required ISO 9094-1, 2"]
["Circular: inner Diam > 450 mm",null,null,{"$f":"IF(D5=\"C\",IF(D8>450,\"pass\",\"fail\"),\"n.a.\")","v":"n.a."}]
["Rectang: inner Diam > 380 mm",null,null,{"$f":"IF(D5=\"R\",IF(MAX(D6:D7)>380,\"pass\",\"fail\"),\"n.a.\")","v":"n.a."}]
["              Area > 180000 mm²",null,null,{"$f":"IF(D5=\"R\",IF(D6*D7>180000,\"pass\",\"fail\"),\"n.a.\")","v":"n.a."}]

{"sheet":"basic design pressure 12","index":39,"n_rows":193,"n_cols":10,"rows_kept":193,"hidden":true}
["Basic design pressure",null,null,"(7.4 Table 4)"]
[]
["location",null,{"$f":"'main Side windows 12'!D11","v":0}]
["particular",null,{"$f":"IF(AND(C5=\"C\",C6=\"M\",C3=\"III\"),\"A\",'main Side windows 12'!D12)","v":""},null,"Remark: f=front, s=side"]
["design cat",null,{"$f":"'main Side windows 12'!D13","v":0}]
["craft type",null,{"$f":"'main Side windows 12'!D14","v":""},{"$f":"IF(C6=\"Any\",\"S\",C6)","v":""},"Remark: if craft type = Any, set craft type = S"]
[]
[]
["Tabelle 4",null,"location","craft type","design cat","particular","pressure"]
[null,null,"I","Any","Any","Any",70]
[null,null,"IIB","Any","A","Any",70]
[null,null,"IIB","Any","B","Any",50]
[null,null,"IIB","Any","C","Any",28]
[null,null,"IIB","Any","D","Any",28]
[null,null,"IIA","Any","Any","Any",28]
[null,null,"III","S","A","Any",18]
[null,null,"III","S","B","Any",18]
[null,null,"III","S","C","Any",12]
[null,null,"III","S","D","Any",12]
[null,null,"III","M","A","Front",12]
[null,null,"III","M","A","Any",12]
[null,null,"III","M","B","Front",9]
[null,null,"III","M","B","Any",9]
[null,null,"III","M","D","Front",6,null,null,"Korrektur, Zeile eingefügt um Fehler bei eingabe III, M, Front, D zu beheben"]
[null,null,"III","M","A","Side",9]
[null,null,"III","M","B","Side",6]
[null,null,"III","M","C","Any",6]
[null,null,"III","M","D","Any",6]
[null,null,"IV","S","Any","Any",12]
[null,null,"IV","M","Any","Any",6]
[]
["Ergebnis"]
[null,"location = I",{"$nulls":4},{"$f":"IF(C3=\"I\",G10,0)","v":0}]
[null,"location = IIB",{"$nulls":4},{"$f":"IF(C3=\"IIB\",VLOOKUP(C5,E11:G15,3),0)","v":0}]
[null,"location = IIA",{"$nulls":4},{"$f":"IF(C3=\"IIA\",VLOOKUP(C3,E11:G15,3),0)","v":0}]
[null,"location = III","craft = S",{"$nulls":3},{"$f":"IF(AND(C3=\"III\",D6=\"S\"),VLOOKUP(C5,E16:G19,3),0)","v":0}]
[null,"location = III","craft = M","particular = front",null,null,{"$f":"IF(AND(C3=\"III\",D6=\"M\",C4=\"F\"),VLOOKUP(C5,E20:G24,3),0)","v":0}]
[null,"location = III","craft = M","particular = any",null,null,{"$f":"IF(AND(OR(C5=\"A\",C5=\"B\"),C3=\"III\",D6=\"M\",C4=\"A\"),VLOOKUP(C5,E20:G24,3),0)","v":0}]
[null,"location = III","craft = M","particular = side",null,null,{"$f":"IF(AND(C3=\"III\",C6=\"M\",C4=\"S\"),IF(C5=\"A\",9,IF(C5=\"B\",6,0)))","v":false}]
[null,"location = III","craft = M",{"$nulls":3},{"$f":"IF(C5=\"A\",0,IF(C5=\"B\",0,IF(AND(C3=\"III\",C6=\"M\"),VLOOKUP(C5,E27:G28,3))))","v":false}]
[null,"location = IV",{"$nulls":4},{"$f":"IF(C3=\"IV\",VLOOKUP(D6,D29:G30,4,0),1)","v":1}]
[]
["pressure",{"$nulls":5},{"$f":"MAX(G33:G41)","v":1}]
[]
[]
["minimum thickness"]
[]
[null,"Area",{"$f":"IF(OR('main Side windows 12'!D11=\"IIA\",'main Side windows 12'!D11=\"IIB\"),\"II\",'main Side windows 12'!D11)","v":0},{"$nulls":4},"minimum thickness",null,{"$f":"MAX(J50:J190)","v":0}]
[]
[null,null,"PMMA","A","I",{"$f":" IF('main Side windows 12'!$D$15>0,6 + 0.1*('main Side windows 12'!$D$15-4),\"\")","v":""},{"$nulls":3},{"$f":"IF('main Side windows 12'!$D$17=\"PMMA\",(IF('main Side windows 12'!$D$13=\"A\",VLOOKUP($C$48,$E$50:$F$53,2,-1),0)),0)","v":0}]
["Table 5",{"$nulls":3},"II",6]
[{"$nulls":4},"III",5]
[{"$nulls":4},"IV",5]
[null,null,"PMMA","B","I",{"$f":" IF('main Side windows 12'!$D$15>0,6 + 0.1*('main Side windows 12'!$D$15-4),\"\")","v":""},{"$nulls":3},{"$f":"IF('main Side windows 12'!$D$17=\"PMMA\",(IF('main Side windows 12'!$D$13=\"B\",VLOOKUP($C$48,$E$54:$F$57,2,-1),0)),0)","v":0}]
[{"$nulls":4},"II",6]
[{"$nulls":4},"III",5]
[{"$nulls":4},"IV",5]
[null,null,"PMMA","C","I",{"$f":" IF('main Side windows 12'!$D$15>0,6 + 0.1*('main Side windows 12'!$D$15-4),\"\")","v":""},{"$nulls":3},{"$f":"IF('main Side windows 12'!$D$17=\"PMMA\",(IF('main Side windows 12'!$D$13=\"C\",VLOOKUP($C$48,$E$58:$F$61,2,-1),0)),0)","v":0}]
[{"$nulls":4},"II",6]
[{"$nulls":4},"III",4]
[{"$nulls":4},"IV",4]
[null,null,"PMMA","D","I",{"$f":" IF('main Side windows 12'!$D$15>0,6 + 0.1*('main Side windows 12'!$D$15-4),\"\")","v":""},{"$nulls":3},{"$f":"IF('main Side windows 12'!$D$17=\"PMMA\",(IF('main Side windows 12'!$D$13=\"D\",VLOOKUP($C$48,E62:F65,2,-1),0)),0)","v":0}]
[{"$nulls":4},"II",6]
[{"$nulls":4},"III",4]
[{"$nulls":4},"IV",4]
[null,null,"PC","A","I",{"$f":" IF('main Side windows 12'!$D$15>0,6 + 0.1*('main Side windows 12'!$D$15-4),\"\")","v":""},{"$nulls":3},{"$f":"IF('main Side windows 12'!$D$17=\"PC\",(IF('main Side windows 12'!$D$13=\"A\",VLOOKUP($C$48,E66:F70,2,-1),0)),0)","v":0}]
[{"$nulls":4},"II",6]
[{"$nulls":4},"III",5]
[{"$nulls":4},"IV",5]
[null,null,"PC","B","I",{"$f":" IF('main Side windows 12'!$D$15>0,6 + 0.1*('main Side windows 12'!$D$15-4),\"\")","v":""},{"$nulls":3},{"$f":"IF('main Side windows 12'!$D$17=\"PC\",(IF('main Side windows 12'!$D$13=\"B\",VLOOKUP($C$48,E70:F73,2,-1),0)),0)","v":0}]
[{"$nulls":4},"II",6]
[{"$nulls":4},"III",5]
[{"$nulls":4},"IV",5]
[null,null,"PC","C","I",{"$f":" IF('main Side windows 12'!$D$15>0,6 + 0.1*('main Side windows 12'!$D$15-4),\"\")","v":""},{"$nulls":3},{"$f":"IF('main Side windows 12'!$D$17=\"PC\",(IF('main Side windows 12'!$D$13=\"C\",VLOOKUP($C$48,E74:F77,2,-1),0)),0)","v":0}]
[{"$nulls":4},"II",6]
[{"$nulls":4},"III",4]
[{"$nulls":4},"IV",4]
[null,null,"PC","D","I",{"$f":" IF('main Side windows 12'!$D$15>0,6 + 0.1*('main Side windows 12'!$D$15-4),\"\")","v":""},{"$nulls":3},{"$f":"IF('main Side windows 12'!$D$17=\"PC\",(IF('main Side windows 12'!$D$13=\"D\",VLOOKUP($C$48,E78:F81,2,-1),0)),0)","v":0}]
[{"$nulls":4},"II",6]
[{"$nulls":4},"III",4]
[{"$nulls":4},"IV",4]
[null,null,"TG","A","I",{"$f":" IF('main Side windows 12'!$D$15>0,5+ 0.1*('main Side windows 12'!$D$15-4),\"\")","v":""},{"$nulls":3},{"$f":"IF('main Side windows 12'!$D$17=\"TG\",(IF('main Side windows 12'!$D$13=\"A\",VLOOKUP($C$48,E82:F85,2,-1),0)),0)","v":0}]
[{"$nulls":4},"II",4]
[{"$nulls":4},"III",4]
[{"$nulls":4},"IV",4]
[null,null,"TG","B","I",{"$f":" IF('main Side windows 12'!$D$15>0,5+ 0.1*('main Side windows 12'!$D$15-4),\"\")","v":""},{"$nulls":3},{"$f":"IF('main Side windows 12'!$D$17=\"TG\",(IF('main Side windows 12'!$D$13=\"B\",VLOOKUP($C$48,E86:F89,2,-1),0)),0)","v":0}]
[{"$nulls":4},"II",4]
[{"$nulls":4},"III",4]
[{"$nulls":4},"IV",4]
[null,null,"TG","C","I",{"$f":" IF('main Side windows 12'!$D$15>0,5+ 0.1*('main Side windows 12'!$D$15-4),\"\")","v":""},{"$nulls":3},{"$f":"IF('main Side windows 12'!$D$17=\"TG\",(IF('main Side windows 12'!$D$13=\"C\",VLOOKUP($C$48,E90:F93,2,-1),0)),0)","v":0}]
[{"$nulls":4},"II",4]
[{"$nulls":4},"III",3]
[{"$nulls":4},"IV",3]
[null,null,"TG","D","I",{"$f":" IF('main Side windows 12'!$D$15>0,5+ 0.1*('main Side windows 12'!$D$15-4),\"\")","v":""},{"$nulls":3},{"$f":"IF('main Side windows 12'!$D$17=\"TG\",(IF('main Side windows 12'!$D$13=\"D\",VLOOKUP($C$48,E94:F97,2,-1),0)),0)","v":0}]
[{"$nulls":4},"II",4]
[{"$nulls":4},"III",3]
[{"$nulls":4},"IV",3]
[null,null,"LG","A","I",{"$f":" IF('main Side windows 12'!$D$15>0,5+ 0.1*('main Side windows 12'!$D$15-4),\"\")","v":""},{"$nulls":3},{"$f":"IF('main Side windows 12'!$D$17=\"LG\",(IF('main Side windows 12'!$D$13=\"A\",VLOOKUP($C$48,E98:F101,2,-1),0)),0)","v":0}]
[{"$nulls":4},"II",4]
[{"$nulls":4},"III",4]
[{"$nulls":4},"IV",4]
[null,null,"LG","B","I",{"$f":" IF('main Side windows 12'!$D$15>0,5+ 0.1*('main Side windows 12'!$D$15-4),\"\")","v":""},{"$nulls":3},{"$f":"IF('main Side windows 12'!$D$17=\"LG\",(IF('main Side windows 12'!$D$13=\"B\",VLOOKUP($C$48,E102:F105,2,-1),0)),0)","v":0}]
[{"$nulls":4},"II",4]
[{"$nulls":4},"III",4]
[{"$nulls":4},"IV",4]
[null,null,"LG","C","I",{"$f":" IF('main Side windows 12'!$D$15>0,5+ 0.1*('main Side windows 12'!$D$15-4),\"\")","v":""},{"$nulls":3},{"$f":"IF('main Side windows 12'!$D$17=\"LG\",(IF('main Side windows 12'!$D$13=\"C\",VLOOKUP($C$48,E106:F109,2,-1),0)),0)","v":0}]
[{"$nulls":4},"II",4]
[{"$nulls":4},"III",3]
[{"$nulls":4},"IV",3]
[null,null,"LG","D","I",{"$f":" IF('main Side windows 12'!$D$15>0,5+ 0.1*('main Side windows 12'!$D$15-4),\"\")","v":""},{"$nulls":3},{"$f":"IF('main Side windows 12'!$D$17=\"LG\",(IF('main Side windows 12'!$D$13=\"D\",VLOOKUP($C$48,E110:F113,2,-1),0)),0)","v":0}]
[{"$nulls":4},"II",4]
[{"$nulls":4},"III",3]
[{"$nulls":4},"IV",3]
[null,null,"AMPW","A","I",{"$f":" IF('main Side windows 12'!$D$15>0,8+ 0.1*('main Side windows 12'!$D$15-4),\"\")","v":""},{"$nulls":3},{"$f":"IF('main Side windows 12'!$D$17=\"AMPW\",(IF('main Side windows 12'!$D$13=\"A\",VLOOKUP($C$48,E114:F117,2,-1),0)),0)","v":0}]
[{"$nulls":4},"II",6]
[{"$nulls":4},"III",5]
[{"$nulls":4},"IV",5]
[null,null,"AMPW","B","I",{"$f":" IF('main Side windows 12'!$D$15>0,8+ 0.1*('main Side windows 12'!$D$15-4),\"\")","v":""},{"$nulls":3},{"$f":"IF('main Side windows 12'!$D$17=\"AMPW\",(IF('main Side windows 12'!$D$13=\"B\",VLOOKUP($C$48,E118:F121,2,-1),0)),0)","v":0}]
[{"$nulls":4},"II",6]
[{"$nulls":4},"III",5]
[{"$nulls":4},"IV",5]
[null,null,"AMPW","C","I",{"$f":" IF('main Side windows 12'!$D$15>0,8+ 0.1*('main Side windows 12'!$D$15-4),\"\")","v":""},{"$nulls":3},{"$f":"IF('main Side windows 12'!$D$17=\"AMPW\",(IF('main Side windows 12'!$D$13=\"C\",VLOOKUP($C$48,E122:F125,2,-1),0)),0)","v":0}]
[{"$nulls":4},"II",6]
[{"$nulls":4},"III",4]
[{"$nulls":4},"IV",4]
[null,null,"AMPW","D","I",{"$f":" IF('main Side windows 12'!$D$15>0,8+ 0.1*('main Side windows 12'!$D$15-4),\"\")","v":""},{"$nulls":3},{"$f":"IF('main Side windows 12'!$D$17=\"AMPW\",(IF('main Side windows 12'!$D$13=\"D\",VLOOKUP($C$48,E126:F129,2,-1),0)),0)","v":0}]
[{"$nulls":4},"II",6]
[{"$nulls":4},"III",4]
[{"$nulls":4},"IV",4]
[null,null,"GRP m30","A","I",{"$f":" IF('main Side windows 12'!$D$15>0,4 + 0.1*('main Side windows 12'!$D$15-4),\"\")","v":""},{"$nulls":3},{"$f":"IF('main Side windows 12'!$D$17=\"GRP M30\",(IF('main Side windows 12'!$D$13=\"A\",VLOOKUP($C$48,E130:F133,2,-1),0)),0)","v":0}]
[{"$nulls":4},"II",3]
[{"$nulls":4},"III",3]
[{"$nulls":4},"IV",3]
[null,null,"GRP m30","B","I",{"$f":" IF('main Side windows 12'!$D$15>0,4 + 0.1*('main Side windows 12'!$D$15-4),\"\")","v":""},{"$nulls":3},{"$f":"IF('main Side windows 12'!$D$17=\"GRP M30\",(IF('main Side windows 12'!$D$13=\"B\",VLOOKUP($C$48,E134:F137,2,-1),0)),0)","v":0}]
[{"$nulls":4},"II",3]
[{"$nulls":4},"III",3]
[{"$nulls":4},"IV",3]
[null,null,"GRP m30","C","I",{"$f":" IF('main Side windows 12'!$D$15>0,4 + 0.1*('main Side windows 12'!$D$15-4),\"\")","v":""},{"$nulls":3},{"$f":"IF('main Side windows 12'!$D$17=\"GRP M30\",(IF('main Side windows 12'!$D$13=\"C\",VLOOKUP($C$48,E138:F141,2,-1),0)),0)","v":0}]
[{"$nulls":4},"II",3]
[{"$nulls":4},"III",2]
[{"$nulls":4},"IV",2]
[null,null,"GRP m30","D","I",{"$f":" IF('main Side windows 12'!$D$15>0,4 + 0.1*('main Side windows 12'!$D$15-4),\"\")","v":""},{"$nulls":3},{"$f":"IF('main Side windows 12'!$D$17=\"GRP M30\",(IF('main Side windows 12'!$D$13=\"D\",VLOOKUP($C$48,E142:F145,2,-1),0)),0)","v":0}]
[{"$nulls":4},"II",3]
[{"$nulls":4},"III",2]
[{"$nulls":4},"IV",2]
[null,null,"GRP m35","A","I",{"$f":" IF('main Side windows 12'!$D$15>0,4 + 0.1*('main Side windows 12'!$D$15-4),\"\")","v":""},{"$nulls":3},{"$f":"IF('main Side windows 12'!$D$17=\"GRP M35\",(IF('main Side windows 12'!$D$13=\"A\",VLOOKUP($C$48,E146:F149,2,-1),0)),0)","v":0}]
[{"$nulls":4},"II",3]
[{"$nulls":4},"III",3]
[{"$nulls":4},"IV",3]
[null,null,"GRP m35","B","I",{"$f":" IF('main Side windows 12'!$D$15>0,4 + 0.1*('main Side windows 12'!$D$15-4),\"\")","v":""},{"$nulls":3},{"$f":"IF('main Side windows 12'!$D$17=\"GRP M35\",(IF('main Side windows 12'!$D$13=\"B\",VLOOKUP($C$48,E150:F153,2,-1),0)),0)","v":0}]
[{"$nulls":4},"II",3]
[{"$nulls":4},"III",3]
[{"$nulls":4},"IV",3]
[null,null,"GRP m35","C","I",{"$f":" IF('main Side windows 12'!$D$15>0,4 + 0.1*('main Side windows 12'!$D$15-4),\"\")","v":""},{"$nulls":3},{"$f":"IF('main Side windows 12'!$D$17=\"GRP M35\",(IF('main Side windows 12'!$D$13=\"C\",VLOOKUP($C$48,E154:F157,2,-1),0)),0)","v":0}]
[{"$nulls":4},"II",3]
[{"$nulls":4},"III",2]
[{"$nulls":4},"IV",2]
[null,null,"GRP m35","D","I",{"$f":" IF('main Side windows 12'!$D$15>0,4 + 0.1*('main Side windows 12'!$D$15-4),\"\")","v":""},{"$nulls":3},{"$f":"IF('main Side windows 12'!$D$17=\"GRP M35\",(IF('main Side windows 12'!$D$13=\"D\",VLOOKUP($C$48,E158:F161,2,-1),0)),0)","v":0}]
[{"$nulls":4},"II",3]
[{"$nulls":4},"III",2]
[{"$nulls":4},"IV",2]
[null,null,"Al 5038","A","I",{"$f":" IF('main Side windows 12'!$D$15>0,3 + 0.05*('main Side windows 12'!$D$15-4),\"\")","v":""},{"$nulls":3},{"$f":"IF('main Side windows 12'!$D$17=\"Al 5038\",(IF('main Side windows 12'!$D$13=\"A\",VLOOKUP($C$48,E162:F165,2,-1),0)),0)","v":0}]
[{"$nulls":4},"II",3]
[{"$nulls":4},"III",3]
[{"$nulls":4},"IV",3]
[null,null,"Al 5038","B","I",{"$f":" IF('main Side windows 12'!$D$15>0,3 + 0.05*('main Side windows 12'!$D$15-4),\"\")","v":""},{"$nulls":3},{"$f":"IF('main Side windows 12'!$D$17=\"AL 5038\",(IF('main Side windows 12'!$D$13=\"B\",VLOOKUP($C$48,E166:F169,2,-1),0)),0)","v":0}]
[{"$nulls":4},"II",3]
[{"$nulls":4},"III",3]
[{"$nulls":4},"IV",3]
[null,null,"Al 5038","C","I",{"$f":" IF('main Side windows 12'!$D$15>0,3 + 0.05*('main Side windows 12'!$D$15-4),\"\")","v":""},{"$nulls":3},{"$f":"IF('main Side windows 12'!$D$17=\"AL 5038\",(IF('main Side windows 12'!$D$13=\"C\",VLOOKUP($C$48,E170:F173,2,-1),0)),0)","v":0}]
[{"$nulls":4},"II",3]
[{"$nulls":4},"III",2]
[{"$nulls":4},"IV",2]
[null,null,"Al 5038","D","I",{"$f":" IF('main Side windows 12'!$D$15>0,3 + 0.05*('main Side windows 12'!$D$15-4),\"\")","v":""},{"$nulls":3},{"$f":"IF('main Side windows 12'!$D$17=\"AL 5038\",(IF('main Side windows 12'!$D$13=\"D\",VLOOKUP($C$48,E174:F177,2,-1),0)),0)","v":0}]
[{"$nulls":4},"II",3]
[{"$nulls":4},"III",2]
[{"$nulls":4},"IV",2]
[null,null,"MS","A","I",{"$f":" IF('main Side windows 12'!$D$15>0,2.5 + 0.025*('main Side windows 12'!$D$15-4),\"\")","v":""},{"$nulls":3},{"$f":"IF('main Side windows 12'!$D$17=\"MS\",(IF('main Side windows 12'!$D$13=\"A\",VLOOKUP($C$48,E178:F181,2,-1),0)),0)","v":0}]
[{"$nulls":4},"II",2.5]
[{"$nulls":4},"III",2.5]
[{"$nulls":4},"IV",2.5]
[null,null,"MS","B","I",{"$f":" IF('main Side windows 12'!$D$15>0,2.5 + 0.025*('main Side windows 12'!$D$15-4),\"\")","v":""},{"$nulls":3},{"$f":"IF('main Side windows 12'!$D$17=\"MS\",(IF('main Side windows 12'!$D$13=\"B\",VLOOKUP($C$48,E182:F185,2,-1),0)),0)","v":0}]
[{"$nulls":4},"II",2.5]
[{"$nulls":4},"III",2.5]
[{"$nulls":4},"IV",2.5]
[null,null,"MS","C","I",{"$f":" IF('main Side windows 12'!$D$15>0,2.5 + 0.025*('main Side windows 12'!$D$15-4),\"\")","v":""},{"$nulls":3},{"$f":"IF('main Side windows 12'!$D$17=\"MS\",(IF('main Side windows 12'!$D$13=\"C\",VLOOKUP($C$48,E186:F189,2,-1),0)),0)","v":0}]
[{"$nulls":4},"II",2.5]
[{"$nulls":4},"III",2]
[{"$nulls":4},"IV",2]
[null,null,"MS","D","I",{"$f":" IF('main Side windows 12'!$D$15>0,2.5 + 0.025*('main Side windows 12'!$D$15-4),\"\")","v":""},{"$nulls":3},{"$f":"IF('main Side windows 12'!$D$17=\"MS\",(IF('main Side windows 12'!$D$13=\"D\",VLOOKUP($C$48,E190:F193,2,-1),0)),0)","v":0}]
[{"$nulls":4},"II",2.5]
[{"$nulls":4},"III",2]
[{"$nulls":4},"IV",2]

{"sheet":"Worksheet 13","index":40,"n_rows":45,"n_cols":31,"rows_kept":45,"merged":[[0,0,0,9],[0,11,0,12],[1,0,1,9],[2,0,2,9],[4,0,4,9],[6,0,6,5],[17,13,17,14],[19,13,19,14],[21,12,21,14],[22,15,26,18],[27,6,28,6],[27,7,28,7],[27,15,27,21],[29,15,32,15],[29,16,32,16],[29,17,32,17],[29,18,29,21],[30,18,30,21],[31,18,31,19],[32,11,32,13],[34,13,34,14],[36,13,36,14],[38,13,38,14],[39,13,39,14],[41,13,41,14]]}
[{"$nulls":11},"Comments"]
["ISO 12216:2020 - Small craft - Windows, portlights, hatches, deadlights and doors",{"$nulls":11},"Derived values"]
["WORKSHEET No. 1 data entry",{"$nulls":11},"Input values"]
[]
[{"$f":"CONCATENATE(coverSheet!B5,\"   \",coverSheet!B12,\"   \",Summary!B21)","v":"      "}]
[]
["Parameter",{"$nulls":5},"Symbol","Unit","Value","Ref.",{"$nulls":5},"Material Properties see table F.1 and Tab. 5",{"$nulls":11},"List"]
["Form of plate (Rectangular / Circle)",{"$nulls":5},"R / C",null,{"$f":"Summary!C21","v":0},"Annex C",{"$nulls":5},"Table F.1 mechanical properties [MPa]",null,null,"Tab. 5",{"$nulls":8},"Lists"]
["Long side",{"$nulls":5},"a","mm",{"$f":"Summary!D21","v":0},"7.3, Annex C",{"$nulls":5},"Material","strength","elasticity","safety",{"$nulls":7},"rectangular","R","I","A",{"$f":"IF(I8=\"rectangular\",\"R\",IF(I8=\"circle\",\"C\",\"\"))","v":""}]
["Unsupported short side",{"$nulls":5},"b","mm",{"$f":"Summary!E21","v":0},"7.3, Annex C",{"$nulls":5},"PMMA",110,3000,3.5,{"$nulls":7},"circle","C","IIa","B"]
["Diameter",{"$nulls":5},"d","mm",{"$f":"Summary!F21","v":0},"7.3, Annex C",{"$nulls":5},"PC",90,2400,3.5,{"$nulls":9},"IIb","C"]
["Curve height",{"$nulls":5},"c","mm",{"$f":"Summary!G21","v":0},"7.6",{"$nulls":5},"TG",200,72600,4,{"$nulls":9},"III","D"]
["Support SemiFixed / Simply Supported",{"$nulls":5},"SF / SS",null,{"$f":"Summary!H21","v":0},"3.18",{"$nulls":5},"CG",300,72600,4,{"$nulls":7},"semi-fixed","SF","IV",null,{"$f":"IF(I13=\"semi-fixed\",\"SF\",IF(I13=\"\",\"\",\"SS\"))","v":"SS"}]
["Location type",{"$nulls":5},"I/IIA/IIB/III/IV",null,{"$f":"Summary!I21","v":0},"3.17; Annex A",{"$nulls":5},"AG",40,72600,4,{"$nulls":7},"simply supported","SS"]
["Location area (only loc. III)",{"$nulls":5},"F / S / Any",null,{"$f":"Summary!J21","v":0},"3.17.4",{"$nulls":5},"AMPW",50,7000,2]
["Design Category",{"$nulls":5},"A / B / C / D",null,{"$f":"Summary!K21","v":0},"3.12",{"$nulls":5},"GRP M30",140,7500,2,{"$nulls":6},"any","front","F","Any","yes",{"$f":"IF(I15=\"front\",\"F\",IF(I15=\"side\",\"S\",IF(I15=\"any\",\"A\",\"\")))","v":""}]
["Craft Type Any/Motor/Sail",{"$nulls":5},"Any / M / S",null,{"$f":"Summary!L21","v":0},{"$nulls":6},"GRP M35",175,10000,2,{"$nulls":6},"motor","side","S","M","no"]
["Length of hull as in ISO 8666",{"$nulls":5},"LH","m",{"$f":"Summary!N21","v":{"v":0,"d":"0.00"}},"3.16",{"$nulls":5},"AL 5038",280,70000,2,{"$nulls":6},"sail","any","Any","S",null,{"$f":"IF(I17=\"any\",\"Any\",IF(I17=\"motor\",\"M\",IF(I17=\"sail\",\"S\",\"\")))","v":""}]
["Material data",{"$nulls":7},{"$f":"Summary!O21","v":0},"Table F.1 & 5",{"$nulls":5},"MS",400,200000,2]
[null,"  Ultimate flexural strength",{"$nulls":4},"σU","MPa",{"$f":"'main Side windows 13'!D18","v":{"$error":"#N/A"}},"Table F.1 & 5",{"$nulls":5},"AISI 316 L",510,200000,2]
[null,"  Modulus of elasticity",{"$nulls":4},"E","MPa",{"$f":"'main Side windows 13'!D19","v":{"$error":"#N/A"}},"Table F.1 & 5"]
[null,"  Safety factor",{"$nulls":4},"gamma",". / .",{"$f":"'main Side windows 13'!D20","v":{"$error":"#N/A"}},"Table F.1 & 5",{"$nulls":15},"yes"]
["Is actual plate a sandwich?",{"$nulls":5},"yes / no",null,{"$f":"Summary!Q21","v":0},"7.9",{"$nulls":5},{"$f":"IF(I23=\"YES\",\"The difference in thickness between any two glass plies must be less than or equal to 2 mm and the thickness of the plastic interlayer must be less than, or equal to 0,76 mm for these conditions !\",\"\")","v":""},{"$nulls":9},"no"]
[null,"If yes, enter number of layers",{"$nulls":5},". / .",{"$f":"Summary!R21","v":0},"7.9"]
["Actual plate thickness (in case of sandwich the sum of all layers)",{"$nulls":6},"mm",{"$f":"Summary!U21","v":{"v":0,"d":"0.00"}}]
[]
["Results for non-stiffened plates"]
["Press reduction factor",{"$nulls":5},"Ψ",". / .",{"$f":"'main Side windows 13'!D23","v":false},"7.5"]
["              within limits 0,33 and 1,0",{"$nulls":7},{"$f":"'main Side windows 13'!D24","v":1},"7.5",{"$nulls":5},"Table 5 — Safety factor and minimum thickness of monolithic plates"]
["Basic design press",{"$nulls":5},"p","kPa",{"$f":"'main Side windows 13'!D25","v":1},"7.4",{"$nulls":5},"Material","Acronym","Safety factor\n γ ","Minimum thickness of monolithic plates, tm"]
["Allowable flexural stress",{"$nulls":5},"σa","MPa",{"$f":"'main Side windows 13'!D26","v":{"$error":"#N/A"}},"7.8",{"$nulls":8},"Design categories "]
["Curvature coefficient",{"$nulls":5},"kC",". / .",{"$f":"'main Side windows 13'!D27","v":{"$error":"#DIV/0!"}},"7.6",{"$nulls":8},"Any",null,"A & B","C & D"]
["Ratio a/b (valid ≤ 5)",{"$nulls":6},". / .",{"$f":"'main Side windows 13'!D28","v":{"$error":"#DIV/0!"}},"7.3, Annex G.2",{"$nulls":8},"Area Ia","Area II","Area III & IV","Area III & IV"]
["Ratio a/b corrected",{"$nulls":6},". / .",{"$f":"'main Side windows 13'!D29","v":{"$error":"#DIV/0!"}},"7.3, Annex G.2",{"$nulls":5},"Poly(methyl)methacrylate","PMMA",3.5,"6+0,1(LH-4)",6,5,4]
["Plate aspect ratio coeff stress",{"$nulls":5},"kr",". / .",{"$f":"'main Side windows 13'!D30","v":"FALSCH"},"7.3, Annex G.2",{"$nulls":5},"Polycarbonate","PC",3.5,"6+0,1(LH-4)",6,5,4]
["Pate aspect ratio coeff deflection",{"$nulls":5},"kf",". / .",{"$f":"'main Side windows 13'!D31","v":false},"7.3, Annex G.2",{"$nulls":5},"Monolithic tempered glass ","TG",4,"5+0,1(LH-4)b",4,4,3]
[{"$nulls":15},"Laminated glass ","LG",4,"5+0,1(LH-4)b",4,4,3]
["Thickness (Stress)",{"$nulls":5},"tr","mm",{"$f":"'main Side windows 13'!D33","v":{"$error":"#DIV/0!"}},"7.1.1",{"$nulls":5},"All mahogany plywood ","AMPW",2,"8+0,1(LH-4)",6,5,4]
["Thickness (Deflection)",{"$nulls":5},"tf","mm",{"$f":"'main Side windows 13'!D34","v":{"$error":"#DIV/0!"}},"7.1.2",{"$nulls":5},"GRP mat 30 % glass ","GRP M30",2,"4+0,1(LH-4)",3,3,2]
["Thickness",{"$nulls":6},"mm",{"$f":"'main Side windows 13'!D35","v":{"$error":"#DIV/0!"}},{"$nulls":6},"GRP mat/roving 35 % glass ","GRP M35",2,"4+0,1(LH-4)",3,3,2]
["Thickness minimu, techn. ",{"$nulls":5},"tm","mm",{"$f":"'main Side windows 13'!D36","v":{"$error":"#DIV/0!"}},"7.8",{"$nulls":5},"Aluminium alloy 5083-H111 ","AL 5038",2,"3+0,05 (LH-4)",3,3,2]
["Thickness minimum, Tab 5",{"$nulls":6},"mm",{"$f":"'main Side windows 13'!D37","v":{"v":0,"d":"0.0"}},"Table 5",{"$nulls":5},"Mild steel ","MS",2,"2,5+0,025 (LH-4)",2.5,2.5,2]
[]
["Required plate thickness",{"$nulls":6},"mm",{"$f":"'main Side windows 13'!I31","v":{"$error":"#DIV/0!"}}]
["Requirements fullfilled?",{"$nulls":7},{"$f":"IF(L13=\"short side in area I max 300mm\",\"FAIL\",IF(I25>=I44,\"PASS\",\"FAIL\"))","v":{"$error":"#DIV/0!"}}]

{"sheet":"main Side windows 13","index":41,"n_rows":43,"n_cols":24,"rows_kept":43,"hidden":true,"merged":[[0,0,0,5],[1,0,1,5],[25,11,28,18],[26,6,26,7]]}
[{"$nulls":6},"manufacturer"]
[{"$nulls":6},"model name"]
["Eingabe","Version 1.2.2 / 15-03-2006 rev 060512/070507/dew 090918",{"$nulls":4},"ISO/FDIS 12216:2002(E)"]
["Parameter Input","SSign","Item/Unit",{"$nulls":18},"Lists"]
["form of plate Rectangular/Circle",null,"R/C",{"$f":"'Worksheet 13'!AE9","v":""},{"$f":"IF(D5=\"\",\"Input R oder C\",\"\")","v":"Input R oder C"},null,"Material Properties see table F.1 and Tab. 5",{"$nulls":14},"R","I","A"]
["long side","a","mm",{"$f":"'Worksheet 13'!I9","v":0},{"$f":"IF(AND(D5=\"R\",D6=\"\"),\"Input a requested\",IF(AND(D5=\"C\",D6=\"\"),\"Input d requested\",\"\"))","v":""},null,"Table F.1 mechanical properties [Mpa]",null,null,"Tab. 5",{"$nulls":11},"C","IIa","B"]
["unsupported short side","b","mm",{"$f":"'Worksheet 13'!I10","v":0},{"$f":"IF(AND(D5=\"R\",D7=\"\"),\"Input b requested\",IF(AND(D5=\"C\",D7=\"\"),\"Input d requested\",\"\"))","v":""},null,"Material","strength","elasticity","safety",{"$nulls":12},"IIb","C"]
["diameter","d","mm",{"$f":"'Worksheet 13'!I11","v":0},{"$f":"IF(AND(D5=\"C\",D8=\"\"),\"Input d requested\",\"\")","v":""},null,"PMMA",110,3000,3.5,{"$nulls":3},"AG",40,72600,4,{"$nulls":5},"III","D"]
["curve height","c","mm",{"$f":"'Worksheet 13'!I12","v":0},"optional",null,"PC",90,2400,3.5,{"$nulls":3},"AISI 316 L",510,200000,2,{"$nulls":4},"SF","IV"]
["support SemiFixed/Simple Supp.",null,"SF/SS",{"$f":"'Worksheet 13'!AE13","v":"SS"},{"$f":"IF(D10=\"\",\"Input SF or SS\",\"\")","v":""},null,"TG",200,72600,4,null,null,"6.1","AL 5038",280,70000,2,{"$nulls":4},"SS"]
["Location type",null,"I/IIA/IIB/III/IV",{"$f":"'Worksheet 13'!I14","v":{"v":0,"d":"0.00"}},{"$f":"IF(D11=\"\",\"Input I / IIa,b / III / IV\",\"\")","v":""},null,"CG",300,72600,4,null,null,"3.17.1-4","AMPW",50,7000,2]
["Location area (only loc. III)",null,"F/S/A",{"$f":"'Worksheet 13'!AE16","v":""},{"$f":"IF(D12=\"F\",\"\",IF(D12=\"S\",\"\",IF(D12=\"A\",\"\",IF(D11=\"III\",\"Input F / S / A\",\"\"))))","v":""},null,"AG",40,72600,4,{"$nulls":3},"CG",300,72600,4,{"$nulls":4},"F","Any","yes"]
["Design Category",null,"A/B/C/D",{"$f":"IF('Worksheet 13'!I16=\"\",\"\",'Worksheet 13'!I16)","v":{"v":0,"d":"0.00"}},{"$f":"IF(D13=\"\",\"Input A / B / C / D\",\"\")","v":""},null,"AMPW",50,7000,2,{"$nulls":3},"GRP M30",140,7500,2,{"$nulls":4},"S","M","no"]
["Craft Type Any/Motor/Sail",null,"Any/M/S",{"$f":"'Worksheet 13'!AE18","v":""},{"$f":"IF(D14=\"\",\"Input Any / M / S\",\"\")","v":"Input Any / M / S"},null,"GRP M30",140,7500,2,{"$nulls":3},"GRP M35",175,10000,2,{"$nulls":4},"A","S"]
["optional: craft length of hull",null,"m",{"$f":"'Worksheet 13'!I18","v":{"v":0,"d":"0.00"}},"default, change if smaller",null,"GRP M35",175,10000,2,{"$nulls":3},"MS",400,200000,2]
[{"$nulls":6},"AL 5038",280,70000,2,{"$nulls":3},"PC",90,2400,3.5]
["Material",null,"see Tab. F.1",{"$f":"'Worksheet 13'!I19","v":{"v":0,"d":"0.00"}},{"$f":"IF(D17=\"\",\"manual input requ\",\"\")","v":""},null,"MS",400,200000,2,{"$nulls":3},"PMMA",110,3000,3.5]
["  ultimate flexural strength","Sigma u",null,{"$f":"LOOKUP(D17,N8:N18,O8:O18)","v":{"$error":"#N/A"}},"falls nicht in F.1 ",null,"AISI 316 L",510,200000,2,{"$nulls":3},"TG",200,72600,4]
["  modulus of elasticity","E",null,{"$f":"LOOKUP(D17,N8:N18,P8:P18)","v":{"$error":"#N/A"}},"Werte manuell"]
["  safety factor","gamma",null,{"$f":"LOOKUP(D17,N8:N18,Q8:Q18)","v":{"$error":"#N/A"}},"eintragen"]
[]
["Results for non-stiffened plates"]
["press reduction factor",null,null,{"$f":"IF(D5=\"R\",1.102-0.0004*D7,IF(D5=\"C\",1.102-0.0004*D8))","v":false},"(7.5)"]
["              within limits 0,33 and 1,0","psi",null,{"$f":"IF(D23<0.33,0.33,IF(D23>1,1,D23))","v":{"v":1,"d":"1.000"}},"(7.5)"]
["basic design press","p","KPa",{"$f":"'basic design pressure 13'!G43","v":{"v":1,"d":"1.00"}},"(7.4)",null,"see work sheet \"basic design press\""]
["allowable flexural stress","Sigma a","MPa",{"$f":"D18/D20","v":{"$error":"#N/A"}},"(7.8)",null,"is actual plate a sandwich?",null,{"$f":"'Worksheet 13'!I23","v":0},null,null,{"$f":"IF(I26=\"YES\",\"the difference in thickness between any two glass plies must be less than or equal to 2 mm and the thickness of the plastic interlayer must be less than, or equal to 0,76 mm for these conditions !\",\"\")","v":""}]
["curvature coefficient","kc",null,{"$f":"IF(D5=\"C\",1-(D9/D8),1-(D9/D7))","v":{"$error":"#DIV/0!"}},"(7.6)",null,{"$f":"IF(I26=\"yes\", \"number of layers?\",\"\")","v":""},null,{"$f":"IF('Worksheet 13'!I24=\"\",\"\",'Worksheet 13'!I24)","v":0}]
["              a/b real  (valid ≤ 5)",null,null,{"$f":"IF(D5=\"C\",1,D6/D7)","v":{"$error":"#DIV/0!"}},"(7.3) Annex G.2"]
["              a/b corrected",null,null,{"$f":"IF(D28>5,5,D28)","v":{"$error":"#DIV/0!"}},"(7.3) Annex G.2"]
["plate aspect ratio coeff stress","kr",null,{"$f":"IF(D5=\"R\",IF(D10=\"SF\",(0.62165*D29^2-0.6473*D29+0.26481)/(D29^2-1.173*D29+0.97671),IF(D10=\"SS\",(0.69952*D29^2+0.02662*D29-0.0735)/(D29^2-0.7185*D29+1.98925),\"Fehler\")),IF(D5=\"C\",IF(D10=\"SF\",0.248,0.309),\"FALSCH\"))","v":"FALSCH"},"(7.3) Annex G.2",null,"actual plate Thickness",null,{"$f":"'Worksheet 13'!I25","v":0},"mm",null,{"$f":"IF(I26=\"yes\", \"=sum of all plies\",\"\")","v":""}]
["pate aspect ratio coeff deflection","kf",null,{"$f":"IF(D5=\"R\",IF(D10=\"SF\",(0.08052*D29^2-0.0272*D29-0.0019)/(D29^2-0.9275*D29+1.70018),IF(D10=\"SS\",(0.12915*D29^2+0.00868*D29-0.0293)/(D29^2-0.887*D29+2.3372),\"Fehler\")),IF(D5=\"C\",IF(D10=\"SF\",0.027,0.043)))","v":false},"(7.3) Annex G.2",null,"required plate thickness",null,{"$f":"IF(AND(I26=\"Yes\",I27=\"\"),\"please enter number of layers\",IF(AND(I26=\"Yes\",I27>2),1.5*MAX(D35:D37),IF(AND(I26=\"Yes\",I27=2),1.2*MAX(D35:D37),IF(I36=\"Yes\",MAX(D36:D37),MAX(D35:D37)))))","v":{"$error":"#DIV/0!"}}]
[{"$nulls":6},"requirements fulfilled?",null,{"$f":"IF(I30=\"\",\"\",IF(I30>=I31,\"PASS\",\"FAIL\"))","v":{"$error":"#DIV/0!"}}]
["Thickness (Stress)","tr","mm",{"$f":"IF(D5=\"C\",D8*D27*SQRT(D30*D24*D25/D26/1000),D7*D27*SQRT(D30*D24*D25/D26/1000))","v":{"$error":"#DIV/0!"}},"(7.1.1)"]
["Thickness (Deflection)","tf","mm",{"$f":"0.45*(D33+D7*D27*POWER((D31*D24*D25/0.02/D19/1000),0.33333))","v":{"$error":"#DIV/0!"}},"(7.1.2)"]
["Thickness",null,null,{"$f":"ROUND(MAX(D33:D34),2)","v":{"$error":"#DIV/0!"}},"(7.1.7)",{"$nulls":3},"Minimum tech used???"]
["Thickness minimu, techn. ",null,"mm",{"$f":"D35-0.5","v":{"$error":"#DIV/0!"}},null,null," = Minimum, absolute",null,{"$f":"Summary!P21","v":0}]
["Thickness minimum, Tab 5","tm","mm",{"$f":"'basic design pressure 13'!J48","v":{"v":0,"d":"0.0"}},"(Tab. 5)",null,"(only PMMA, PC, TG, LG)"]
[]
["Escape Hatch possible ?"]
["Required ISO 9094-1, 2"]
["Circular: inner Diam > 450 mm",null,null,{"$f":"IF(D5=\"C\",IF(D8>450,\"pass\",\"fail\"),\"n.a.\")","v":"n.a."}]
["Rectang: inner Diam > 380 mm",null,null,{"$f":"IF(D5=\"R\",IF(MAX(D6:D7)>380,\"pass\",\"fail\"),\"n.a.\")","v":"n.a."}]
["              Area > 180000 mm²",null,null,{"$f":"IF(D5=\"R\",IF(D6*D7>180000,\"pass\",\"fail\"),\"n.a.\")","v":"n.a."}]

{"sheet":"basic design pressure 13","index":42,"n_rows":193,"n_cols":10,"rows_kept":193,"hidden":true}
["Basic design pressure",null,null,"(7.4 Table 4)"]
[]
["location",null,{"$f":"'main Side windows 13'!D11","v":0}]
["particular",null,{"$f":"IF(AND(C5=\"C\",C6=\"M\",C3=\"III\"),\"A\",'main Side windows 13'!D12)","v":""},null,"Remark: f=front, s=side"]
["design cat",null,{"$f":"'main Side windows 13'!D13","v":0}]
["craft type",null,{"$f":"'main Side windows 13'!D14","v":""},{"$f":"IF(C6=\"Any\",\"S\",C6)","v":""},"Remark: if craft type = Any, set craft type = S"]
[]
[]
["Tabelle 4",null,"location","craft type","design cat","particular","pressure"]
[null,null,"I","Any","Any","Any",70]
[null,null,"IIB","Any","A","Any",70]
[null,null,"IIB","Any","B","Any",50]
[null,null,"IIB","Any","C","Any",28]
[null,null,"IIB","Any","D","Any",28]
[null,null,"IIA","Any","Any","Any",28]
[null,null,"III","S","A","Any",18]
[null,null,"III","S","B","Any",18]
[null,null,"III","S","C","Any",12]
[null,null,"III","S","D","Any",12]
[null,null,"III","M","A","Front",12]
[null,null,"III","M","A","Any",12]
[null,null,"III","M","B","Front",9]
[null,null,"III","M","B","Any",9]
[null,null,"III","M","D","Front",6,null,null,"Korrektur, Zeile eingefügt um Fehler bei eingabe III, M, Front, D zu beheben"]
[null,null,"III","M","A","Side",9]
[null,null,"III","M","B","Side",6]
[null,null,"III","M","C","Any",6]
[null,null,"III","M","D","Any",6]
[null,null,"IV","S","Any","Any",12]
[null,null,"IV","M","Any","Any",6]
[]
["Ergebnis"]
[null,"location = I",{"$nulls":4},{"$f":"IF(C3=\"I\",G10,0)","v":0}]
[null,"location = IIB",{"$nulls":4},{"$f":"IF(C3=\"IIB\",VLOOKUP(C5,E11:G15,3),0)","v":0}]
[null,"location = IIA",{"$nulls":4},{"$f":"IF(C3=\"IIA\",VLOOKUP(C3,E11:G15,3),0)","v":0}]
[null,"location = III","craft = S",{"$nulls":3},{"$f":"IF(AND(C3=\"III\",D6=\"S\"),VLOOKUP(C5,E16:G19,3),0)","v":0}]
[null,"location = III","craft = M","particular = front",null,null,{"$f":"IF(AND(C3=\"III\",D6=\"M\",C4=\"F\"),VLOOKUP(C5,E20:G24,3),0)","v":0}]
[null,"location = III","craft = M","particular = any",null,null,{"$f":"IF(AND(OR(C5=\"A\",C5=\"B\"),C3=\"III\",D6=\"M\",C4=\"A\"),VLOOKUP(C5,E20:G24,3),0)","v":0}]
[null,"location = III","craft = M","particular = side",null,null,{"$f":"IF(AND(C3=\"III\",C6=\"M\",C4=\"S\"),IF(C5=\"A\",9,IF(C5=\"B\",6,0)))","v":false}]
[null,"location = III","craft = M",{"$nulls":3},{"$f":"IF(C5=\"A\",0,IF(C5=\"B\",0,IF(AND(C3=\"III\",C6=\"M\"),VLOOKUP(C5,E27:G28,3))))","v":false}]
[null,"location = IV",{"$nulls":4},{"$f":"IF(C3=\"IV\",VLOOKUP(D6,D29:G30,4,0),1)","v":1}]
[]
["pressure",{"$nulls":5},{"$f":"MAX(G33:G41)","v":1}]
[]
[]
["minimum thickness"]
[]
[null,"Area",{"$f":"IF(OR('main Side windows 13'!D11=\"IIA\",'main Side windows 13'!D11=\"IIB\"),\"II\",'main Side windows 13'!D11)","v":0},{"$nulls":4},"minimum thickness",null,{"$f":"MAX(J50:J190)","v":0}]
[]
[null,null,"PMMA","A","I",{"$f":" IF('main Side windows 13'!$D$15>0,6 + 0.1*('main Side windows 13'!$D$15-4),\"\")","v":""},{"$nulls":3},{"$f":"IF('main Side windows 13'!$D$17=\"PMMA\",(IF('main Side windows 13'!$D$13=\"A\",VLOOKUP($C$48,$E$50:$F$53,2,-1),0)),0)","v":0}]
["Table 5",{"$nulls":3},"II",6]
[{"$nulls":4},"III",5]
[{"$nulls":4},"IV",5]
[null,null,"PMMA","B","I",{"$f":" IF('main Side windows 13'!$D$15>0,6 + 0.1*('main Side windows 13'!$D$15-4),\"\")","v":""},{"$nulls":3},{"$f":"IF('main Side windows 13'!$D$17=\"PMMA\",(IF('main Side windows 13'!$D$13=\"B\",VLOOKUP($C$48,$E$54:$F$57,2,-1),0)),0)","v":0}]
[{"$nulls":4},"II",6]
[{"$nulls":4},"III",5]
[{"$nulls":4},"IV",5]
[null,null,"PMMA","C","I",{"$f":" IF('main Side windows 13'!$D$15>0,6 + 0.1*('main Side windows 13'!$D$15-4),\"\")","v":""},{"$nulls":3},{"$f":"IF('main Side windows 13'!$D$17=\"PMMA\",(IF('main Side windows 13'!$D$13=\"C\",VLOOKUP($C$48,$E$58:$F$61,2,-1),0)),0)","v":0}]
[{"$nulls":4},"II",6]
[{"$nulls":4},"III",4]
[{"$nulls":4},"IV",4]
[null,null,"PMMA","D","I",{"$f":" IF('main Side windows 13'!$D$15>0,6 + 0.1*('main Side windows 13'!$D$15-4),\"\")","v":""},{"$nulls":3},{"$f":"IF('main Side windows 13'!$D$17=\"PMMA\",(IF('main Side windows 13'!$D$13=\"D\",VLOOKUP($C$48,E62:F65,2,-1),0)),0)","v":0}]
[{"$nulls":4},"II",6]
[{"$nulls":4},"III",4]
[{"$nulls":4},"IV",4]
[null,null,"PC","A","I",{"$f":" IF('main Side windows 13'!$D$15>0,6 + 0.1*('main Side windows 13'!$D$15-4),\"\")","v":""},{"$nulls":3},{"$f":"IF('main Side windows 13'!$D$17=\"PC\",(IF('main Side windows 13'!$D$13=\"A\",VLOOKUP($C$48,E66:F69,2,-1),0)),0)","v":0}]
[{"$nulls":4},"II",6]
[{"$nulls":4},"III",5]
[{"$nulls":4},"IV",5]
[null,null,"PC","B","I",{"$f":" IF('main Side windows 13'!$D$15>0,6 + 0.1*('main Side windows 13'!$D$15-4),\"\")","v":""},{"$nulls":3},{"$f":"IF('main Side windows 13'!$D$17=\"PC\",(IF('main Side windows 13'!$D$13=\"B\",VLOOKUP($C$48,E70:F73,2,-1),0)),0)","v":0}]
[{"$nulls":4},"II",6]
[{"$nulls":4},"III",5]
[{"$nulls":4},"IV",5]
[null,null,"PC","C","I",{"$f":" IF('main Side windows 13'!$D$15>0,6 + 0.1*('main Side windows 13'!$D$15-4),\"\")","v":""},{"$nulls":3},{"$f":"IF('main Side windows 13'!$D$17=\"PC\",(IF('main Side windows 13'!$D$13=\"C\",VLOOKUP($C$48,E74:F77,2,-1),0)),0)","v":0}]
[{"$nulls":4},"II",6]
[{"$nulls":4},"III",4]
[{"$nulls":4},"IV",4]
[null,null,"PC","D","I",{"$f":" IF('main Side windows 13'!$D$15>0,6 + 0.1*('main Side windows 13'!$D$15-4),\"\")","v":""},{"$nulls":3},{"$f":"IF('main Side windows 13'!$D$17=\"PC\",(IF('main Side windows 13'!$D$13=\"D\",VLOOKUP($C$48,E78:F81,2,-1),0)),0)","v":0}]
[{"$nulls":4},"II",6]
[{"$nulls":4},"III",4]
[{"$nulls":4},"IV",4]
[null,null,"TG","A","I",{"$f":" IF('main Side windows 13'!$D$15>0,5+ 0.1*('main Side windows 13'!$D$15-4),\"\")","v":""},{"$nulls":3},{"$f":"IF('main Side windows 13'!$D$17=\"TG\",(IF('main Side windows 13'!$D$13=\"A\",VLOOKUP($C$48,E82:F85,2,-1),0)),0)","v":0}]
[{"$nulls":4},"II",4]
[{"$nulls":4},"III",4]
[{"$nulls":4},"IV",4]
[null,null,"TG","B","I",{"$f":" IF('main Side windows 13'!$D$15>0,5+ 0.1*('main Side windows 13'!$D$15-4),\"\")","v":""},{"$nulls":3},{"$f":"IF('main Side windows 13'!$D$17=\"TG\",(IF('main Side windows 13'!$D$13=\"B\",VLOOKUP($C$48,E86:F89,2,-1),0)),0)","v":0}]
[{"$nulls":4},"II",4]
[{"$nulls":4},"III",4]
[{"$nulls":4},"IV",4]
[null,null,"TG","C","I",{"$f":" IF('main Side windows 13'!$D$15>0,5+ 0.1*('main Side windows 13'!$D$15-4),\"\")","v":""},{"$nulls":3},{"$f":"IF('main Side windows 13'!$D$17=\"TG\",(IF('main Side windows 13'!$D$13=\"C\",VLOOKUP($C$48,E90:F93,2,-1),0)),0)","v":0}]
[{"$nulls":4},"II",4]
[{"$nulls":4},"III",3]
[{"$nulls":4},"IV",3]
[null,null,"TG","D","I",{"$f":" IF('main Side windows 13'!$D$15>0,5+ 0.1*('main Side windows 13'!$D$15-4),\"\")","v":""},{"$nulls":3},{"$f":"IF('main Side windows 13'!$D$17=\"TG\",(IF('main Side windows 13'!$D$13=\"D\",VLOOKUP($C$48,E94:F97,2,-1),0)),0)","v":0}]
[{"$nulls":4},"II",4]
[{"$nulls":4},"III",3]
[{"$nulls":4},"IV",3]
[null,null,"LG","A","I",{"$f":" IF('main Side windows 13'!$D$15>0,5+ 0.1*('main Side windows 13'!$D$15-4),\"\")","v":""},{"$nulls":3},{"$f":"IF('main Side windows 13'!$D$17=\"LG\",(IF('main Side windows 13'!$D$13=\"A\",VLOOKUP($C$48,E98:F101,2,-1),0)),0)","v":0}]
[{"$nulls":4},"II",4]
[{"$nulls":4},"III",4]
[{"$nulls":4},"IV",4]
[null,null,"LG","B","I",{"$f":" IF('main Side windows 13'!$D$15>0,5+ 0.1*('main Side windows 13'!$D$15-4),\"\")","v":""},{"$nulls":3},{"$f":"IF('main Side windows 13'!$D$17=\"LG\",(IF('main Side windows 13'!$D$13=\"B\",VLOOKUP($C$48,E102:F105,2,-1),0)),0)","v":0}]
[{"$nulls":4},"II",4]
[{"$nulls":4},"III",4]
[{"$nulls":4},"IV",4]
[null,null,"LG","C","I",{"$f":" IF('main Side windows 13'!$D$15>0,5+ 0.1*('main Side windows 13'!$D$15-4),\"\")","v":""},{"$nulls":3},{"$f":"IF('main Side windows 13'!$D$17=\"LG\",(IF('main Side windows 13'!$D$13=\"C\",VLOOKUP($C$48,E106:F109,2,-1),0)),0)","v":0}]
[{"$nulls":4},"II",4]
[{"$nulls":4},"III",3]
[{"$nulls":4},"IV",3]
[null,null,"LG","D","I",{"$f":" IF('main Side windows 13'!$D$15>0,5+ 0.1*('main Side windows 13'!$D$15-4),\"\")","v":""},{"$nulls":3},{"$f":"IF('main Side windows 13'!$D$17=\"LG\",(IF('main Side windows 13'!$D$13=\"D\",VLOOKUP($C$48,E110:F113,2,-1),0)),0)","v":0}]
[{"$nulls":4},"II",4]
[{"$nulls":4},"III",3]
[{"$nulls":4},"IV",3]
[null,null,"AMPW","A","I",{"$f":" IF('main Side windows 13'!$D$15>0,8+ 0.1*('main Side windows 13'!$D$15-4),\"\")","v":""},{"$nulls":3},{"$f":"IF('main Side windows 13'!$D$17=\"AMPW\",(IF('main Side windows 13'!$D$13=\"A\",VLOOKUP($C$48,E114:F117,2,-1),0)),0)","v":0}]
[{"$nulls":4},"II",6]
[{"$nulls":4},"III",5]
[{"$nulls":4},"IV",5]
[null,null,"AMPW","B","I",{"$f":" IF('main Side windows 13'!$D$15>0,8+ 0.1*('main Side windows 13'!$D$15-4),\"\")","v":""},{"$nulls":3},{"$f":"IF('main Side windows 13'!$D$17=\"AMPW\",(IF('main Side windows 13'!$D$13=\"B\",VLOOKUP($C$48,E118:F121,2,-1),0)),0)","v":0}]
[{"$nulls":4},"II",6]
[{"$nulls":4},"III",5]
[{"$nulls":4},"IV",5]
[null,null,"AMPW","C","I",{"$f":" IF('main Side windows 13'!$D$15>0,8+ 0.1*('main Side windows 13'!$D$15-4),\"\")","v":""},{"$nulls":3},{"$f":"IF('main Side windows 13'!$D$17=\"AMPW\",(IF('main Side windows 13'!$D$13=\"C\",VLOOKUP($C$48,E122:F125,2,-1),0)),0)","v":0}]
[{"$nulls":4},"II",6]
[{"$nulls":4},"III",4]
[{"$nulls":4},"IV",4]
[null,null,"AMPW","D","I",{"$f":" IF('main Side windows 13'!$D$15>0,8+ 0.1*('main Side windows 13'!$D$15-4),\"\")","v":""},{"$nulls":3},{"$f":"IF('main Side windows 13'!$D$17=\"AMPW\",(IF('main Side windows 13'!$D$13=\"D\",VLOOKUP($C$48,E126:F129,2,-1),0)),0)","v":0}]
[{"$nulls":4},"II",6]
[{"$nulls":4},"III",4]
[{"$nulls":4},"IV",4]
[null,null,"GRP m30","A","I",{"$f":" IF('main Side windows 13'!$D$15>0,6 + 0.1*('main Side windows 13'!$D$15-4),\"\")","v":""},{"$nulls":3},{"$f":"IF('main Side windows 13'!$D$17=\"GRP M30\",(IF('main Side windows 13'!$D$13=\"A\",VLOOKUP($C$48,E130:F133,2,-1),0)),0)","v":0}]
[{"$nulls":4},"II",3]
[{"$nulls":4},"III",3]
[{"$nulls":4},"IV",3]
[null,null,"GRP m30","B","I",{"$f":" IF('main Side windows 13'!$D$15>0,6 + 0.1*('main Side windows 13'!$D$15-4),\"\")","v":""},{"$nulls":3},{"$f":"IF('main Side windows 13'!$D$17=\"GRP M30\",(IF('main Side windows 13'!$D$13=\"B\",VLOOKUP($C$48,E134:F137,2,-1),0)),0)","v":0}]
[{"$nulls":4},"II",3]
[{"$nulls":4},"III",3]
[{"$nulls":4},"IV",3]
[null,null,"GRP m30","C","I",{"$f":" IF('main Side windows 13'!$D$15>0,6 + 0.1*('main Side windows 13'!$D$15-4),\"\")","v":""},{"$nulls":3},{"$f":"IF('main Side windows 13'!$D$17=\"GRP M30\",(IF('main Side windows 13'!$D$13=\"C\",VLOOKUP($C$48,E138:F141,2,-1),0)),0)","v":0}]
[{"$nulls":4},"II",3]
[{"$nulls":4},"III",2]
[{"$nulls":4},"IV",2]
[null,null,"GRP m30","D","I",{"$f":" IF('main Side windows 13'!$D$15>0,6 + 0.1*('main Side windows 13'!$D$15-4),\"\")","v":""},{"$nulls":3},{"$f":"IF('main Side windows 13'!$D$17=\"GRP M30\",(IF('main Side windows 13'!$D$13=\"D\",VLOOKUP($C$48,E142:F145,2,-1),0)),0)","v":0}]
[{"$nulls":4},"II",3]
[{"$nulls":4},"III",2]
[{"$nulls":4},"IV",2]
[null,null,"GRP m35","A","I",{"$f":" IF('main Side windows 13'!$D$15>0,6 + 0.1*('main Side windows 13'!$D$15-4),\"\")","v":""},{"$nulls":3},{"$f":"IF('main Side windows 13'!$D$17=\"GRP M35\",(IF('main Side windows 13'!$D$13=\"A\",VLOOKUP($C$48,E146:F149,2,-1),0)),0)","v":0}]
[{"$nulls":4},"II",3]
[{"$nulls":4},"III",3]
[{"$nulls":4},"IV",3]
[null,null,"GRP m35","B","I",{"$f":" IF('main Side windows 13'!$D$15>0,6 + 0.1*('main Side windows 13'!$D$15-4),\"\")","v":""},{"$nulls":3},{"$f":"IF('main Side windows 13'!$D$17=\"GRP M35\",(IF('main Side windows 13'!$D$13=\"B\",VLOOKUP($C$48,E150:F153,2,-1),0)),0)","v":0}]
[{"$nulls":4},"II",3]
[{"$nulls":4},"III",3]
[{"$nulls":4},"IV",3]
[null,null,"GRP m35","C","I",{"$f":" IF('main Side windows 13'!$D$15>0,6 + 0.1*('main Side windows 13'!$D$15-4),\"\")","v":""},{"$nulls":3},{"$f":"IF('main Side windows 13'!$D$17=\"GRP M35\",(IF('main Side windows 13'!$D$13=\"C\",VLOOKUP($C$48,E154:F157,2,-1),0)),0)","v":0}]
[{"$nulls":4},"II",3]
[{"$nulls":4},"III",2]
[{"$nulls":4},"IV",2]
[null,null,"GRP m35","D","I",{"$f":" IF('main Side windows 13'!$D$15>0,6 + 0.1*('main Side windows 13'!$D$15-4),\"\")","v":""},{"$nulls":3},{"$f":"IF('main Side windows 13'!$D$17=\"GRP M35\",(IF('main Side windows 13'!$D$13=\"D\",VLOOKUP($C$48,E158:F161,2,-1),0)),0)","v":0}]
[{"$nulls":4},"II",3]
[{"$nulls":4},"III",2]
[{"$nulls":4},"IV",2]
[null,null,"Al 5038","A","I",{"$f":" IF('main Side windows 13'!$D$15>0,3 + 0.05*('main Side windows 13'!$D$15-4),\"\")","v":""},{"$nulls":3},{"$f":"IF('main Side windows 13'!$D$17=\"Al 5038\",(IF('main Side windows 13'!$D$13=\"A\",VLOOKUP($C$48,E162:F165,2,-1),0)),0)","v":0}]
[{"$nulls":4},"II",3]
[{"$nulls":4},"III",3]
[{"$nulls":4},"IV",3]
[null,null,"Al 5038","B","I",{"$f":" IF('main Side windows 13'!$D$15>0,3 + 0.05*('main Side windows 13'!$D$15-4),\"\")","v":""},{"$nulls":3},{"$f":"IF('main Side windows 13'!$D$17=\"AL 5038\",(IF('main Side windows 13'!$D$13=\"B\",VLOOKUP($C$48,E166:F169,2,-1),0)),0)","v":0}]
[{"$nulls":4},"II",3]
[{"$nulls":4},"III",3]
[{"$nulls":4},"IV",3]
[null,null,"Al 5038","C","I",{"$f":" IF('main Side windows 13'!$D$15>0,3 + 0.05*('main Side windows 13'!$D$15-4),\"\")","v":""},{"$nulls":3},{"$f":"IF('main Side windows 13'!$D$17=\"AL 5038\",(IF('main Side windows 13'!$D$13=\"C\",VLOOKUP($C$48,E170:F173,2,-1),0)),0)","v":0}]
[{"$nulls":4},"II",3]
[{"$nulls":4},"III",2]
[{"$nulls":4},"IV",2]
[null,null,"Al 5038","D","I",{"$f":" IF('main Side windows 13'!$D$15>0,3 + 0.05*('main Side windows 13'!$D$15-4),\"\")","v":""},{"$nulls":3},{"$f":"IF('main Side windows 13'!$D$17=\"AL 5038\",(IF('main Side windows 13'!$D$13=\"D\",VLOOKUP($C$48,E174:F177,2,-1),0)),0)","v":0}]
[{"$nulls":4},"II",3]
[{"$nulls":4},"III",2]
[{"$nulls":4},"IV",2]
[null,null,"MS","A","I",{"$f":" IF('main Side windows 13'!$D$15>0,2.5 + 0.025*('main Side windows 13'!$D$15-4),\"\")","v":""},{"$nulls":3},{"$f":"IF('main Side windows 13'!$D$17=\"MS\",(IF('main Side windows 13'!$D$13=\"A\",VLOOKUP($C$48,E178:F181,2,-1),0)),0)","v":0}]
[{"$nulls":4},"II",2.5]
[{"$nulls":4},"III",2.5]
[{"$nulls":4},"IV",2.5]
[null,null,"MS","B","I",{"$f":" IF('main Side windows 13'!$D$15>0,2.5 + 0.025*('main Side windows 13'!$D$15-4),\"\")","v":""},{"$nulls":3},{"$f":"IF('main Side windows 13'!$D$17=\"MS\",(IF('main Side windows 13'!$D$13=\"B\",VLOOKUP($C$48,E182:F185,2,-1),0)),0)","v":0}]
[{"$nulls":4},"II",2.5]
[{"$nulls":4},"III",2.5]
[{"$nulls":4},"IV",2.5]
[null,null,"MS","C","I",{"$f":" IF('main Side windows 13'!$D$15>0,2.5 + 0.025*('main Side windows 13'!$D$15-4),\"\")","v":""},{"$nulls":3},{"$f":"IF('main Side windows 13'!$D$17=\"MS\",(IF('main Side windows 13'!$D$13=\"C\",VLOOKUP($C$48,E186:F189,2,-1),0)),0)","v":0}]
[{"$nulls":4},"II",2.5]
[{"$nulls":4},"III",2.5]
[{"$nulls":4},"IV",2.5]
[null,null,"MS","D","I",{"$f":" IF('main Side windows 13'!$D$15>0,2.5 + 0.025*('main Side windows 13'!$D$15-4),\"\")","v":""},{"$nulls":3},{"$f":"IF('main Side windows 13'!$D$17=\"MS\",(IF('main Side windows 13'!$D$13=\"D\",VLOOKUP($C$48,E190:F193,2,-1),0)),0)","v":0}]
[{"$nulls":4},"II",2.5]
[{"$nulls":4},"III",2.5]
[{"$nulls":4},"IV",2.5]

{"sheet":"Worksheet 14","index":43,"n_rows":45,"n_cols":31,"rows_kept":45,"merged":[[0,0,0,9],[0,11,0,12],[1,0,1,9],[2,0,2,9],[4,0,4,9],[6,0,6,5],[17,13,17,14],[19,13,19,14],[21,12,21,14],[22,15,26,18],[27,6,28,6],[27,7,28,7],[27,15,27,21],[29,15,32,15],[29,16,32,16],[29,17,32,17],[29,18,29,21],[30,18,30,21],[31,18,31,19],[32,11,32,13],[34,13,34,14],[36,13,36,14],[38,13,38,14],[39,13,39,14],[41,13,41,14]]}
[{"$nulls":11},"Comments"]
["ISO 12216:2020 - Small craft - Windows, portlights, hatches, deadlights and doors",{"$nulls":11},"Derived values"]
["WORKSHEET No. 1 data entry",{"$nulls":11},"Input values"]
[]
[{"$f":"CONCATENATE(coverSheet!B5,\"   \",coverSheet!B12,\"   \",Summary!B22)","v":"      "}]
[]
["Parameter",{"$nulls":5},"Symbol","Unit","Value","Ref.",{"$nulls":5},"Material Properties see table F.1 and Tab. 5",{"$nulls":11},"List"]
["Form of plate (Rectangular / Circle)",{"$nulls":5},"R / C",null,{"$f":"Summary!C22","v":0},"Annex C",{"$nulls":5},"Table F.1 mechanical properties [MPa]",null,null,"Tab. 5",{"$nulls":8},"Lists"]
["Long side",{"$nulls":5},"a","mm",{"$f":"Summary!D22","v":0},"7.3, Annex C",{"$nulls":5},"Material","strength","elasticity","safety",{"$nulls":7},"rectangular","R","I","A",{"$f":"IF(I8=\"rectangular\",\"R\",IF(I8=\"circle\",\"C\",\"\"))","v":""}]
["Unsupported short side",{"$nulls":5},"b","mm",{"$f":"Summary!E22","v":0},"7.3, Annex C",{"$nulls":5},"PMMA",110,3000,3.5,{"$nulls":7},"circle","C","IIa","B"]
["Diameter",{"$nulls":5},"d","mm",{"$f":"Summary!F22","v":0},"7.3, Annex C",{"$nulls":5},"PC",90,2400,3.5,{"$nulls":9},"IIb","C"]
["Curve height",{"$nulls":5},"c","mm",{"$f":"Summary!G22","v":0},"7.6",{"$nulls":5},"TG",200,72600,4,{"$nulls":9},"III","D"]
["Support SemiFixed / Simply Supported",{"$nulls":5},"SF / SS",null,{"$f":"Summary!H22","v":0},"3.18",{"$nulls":5},"CG",300,72600,4,{"$nulls":7},"semi-fixed","SF","IV",null,{"$f":"IF(I13=\"semi-fixed\",\"SF\",IF(I13=\"\",\"\",\"SS\"))","v":"SS"}]
["Location type",{"$nulls":5},"I/IIA/IIB/III/IV",null,{"$f":"Summary!I22","v":0},"3.17; Annex A",{"$nulls":5},"AG",40,72600,4,{"$nulls":7},"simply supported","SS"]
["Location area (only loc. III)",{"$nulls":5},"F / S / Any",null,{"$f":"Summary!J22","v":0},"3.17.4",{"$nulls":5},"AMPW",50,7000,2]
["Design Category",{"$nulls":5},"A / B / C / D",null,{"$f":"Summary!K22","v":0},"3.12",{"$nulls":5},"GRP M30",140,7500,2,{"$nulls":6},"any","front","F","Any","yes",{"$f":"IF(I15=\"front\",\"F\",IF(I15=\"side\",\"S\",IF(I15=\"any\",\"A\",\"\")))","v":""}]
["Craft Type Any/Motor/Sail",{"$nulls":5},"Any / M / S",null,{"$f":"Summary!L22","v":0},{"$nulls":6},"GRP M35",175,10000,2,{"$nulls":6},"motor","side","S","M","no"]
["Length of hull as in ISO 8666",{"$nulls":5},"LH","m",{"$f":"Summary!N22","v":{"v":0,"d":"0.00"}},"3.16",{"$nulls":5},"AL 5038",280,70000,2,{"$nulls":6},"sail","any","Any","S",null,{"$f":"IF(I17=\"any\",\"Any\",IF(I17=\"motor\",\"M\",IF(I17=\"sail\",\"S\",\"\")))","v":""}]
["Material data",{"$nulls":7},{"$f":"Summary!O22","v":0},"Table F.1 & 5",{"$nulls":5},"MS",400,200000,2]
[null,"  Ultimate flexural strength",{"$nulls":4},"σU","MPa",{"$f":"'main Side windows 14'!D18","v":{"$error":"#N/A"}},"Table F.1 & 5",{"$nulls":5},"AISI 316 L",510,200000,2]
[null,"  Modulus of elasticity",{"$nulls":4},"E","MPa",{"$f":"'main Side windows 14'!D19","v":{"$error":"#N/A"}},"Table F.1 & 5"]
[null,"  Safety factor",{"$nulls":4},"gamma",". / .",{"$f":"'main Side windows 14'!D20","v":{"$error":"#N/A"}},"Table F.1 & 5",{"$nulls":15},"yes"]
["Is actual plate a sandwich?",{"$nulls":5},"yes / no",null,{"$f":"Summary!Q22","v":0},"7.9",{"$nulls":5},{"$f":"IF(I23=\"YES\",\"The difference in thickness between any two glass plies must be less than or equal to 2 mm and the thickness of the plastic interlayer must be less than, or equal to 0,76 mm for these conditions !\",\"\")","v":""},{"$nulls":9},"no"]
[null,"If yes, enter number of layers",{"$nulls":5},". / .",{"$f":"Summary!R22","v":0},"7.9"]
["Actual plate thickness (in case of sandwich the sum of all layers)",{"$nulls":6},"mm",{"$f":"Summary!U22","v":{"v":0,"d":"0.00"}}]
[]
["Results for non-stiffened plates"]
["Press reduction factor",{"$nulls":5},"Ψ",". / .",{"$f":"'main Side windows 14'!D23","v":false},"7.5"]
["              within limits 0,33 and 1,0",{"$nulls":7},{"$f":"'main Side windows 14'!D24","v":1},"7.5",{"$nulls":5},"Table 5 — Safety factor and minimum thickness of monolithic plates"]
["Basic design press",{"$nulls":5},"p","kPa",{"$f":"'main Side windows 14'!D25","v":1},"7.4",{"$nulls":5},"Material","Acronym","Safety factor\n γ ","Minimum thickness of monolithic plates, tm"]
["Allowable flexural stress",{"$nulls":5},"σa","MPa",{"$f":"'main Side windows 14'!D26","v":{"$error":"#N/A"}},"7.8",{"$nulls":8},"Design categories "]
["Curvature coefficient",{"$nulls":5},"kC",". / .",{"$f":"'main Side windows 14'!D27","v":{"$error":"#DIV/0!"}},"7.6",{"$nulls":8},"Any",null,"A & B","C & D"]
["Ratio a/b (valid ≤ 5)",{"$nulls":6},". / .",{"$f":"'main Side windows 14'!D28","v":{"$error":"#DIV/0!"}},"7.3, Annex G.2",{"$nulls":8},"Area Ia","Area II","Area III & IV","Area III & IV"]
["Ratio a/b corrected",{"$nulls":6},". / .",{"$f":"'main Side windows 14'!D29","v":{"$error":"#DIV/0!"}},"7.3, Annex G.2",{"$nulls":5},"Poly(methyl)methacrylate","PMMA",3.5,"6+0,1(LH-4)",6,5,4]
["Plate aspect ratio coeff stress",{"$nulls":5},"kr",". / .",{"$f":"'main Side windows 14'!D30","v":"FALSCH"},"7.3, Annex G.2",{"$nulls":5},"Polycarbonate","PC",3.5,"6+0,1(LH-4)",6,5,4]
["Pate aspect ratio coeff deflection",{"$nulls":5},"kf",". / .",{"$f":"'main Side windows 14'!D31","v":false},"7.3, Annex G.2",{"$nulls":5},"Monolithic tempered glass ","TG",4,"5+0,1(LH-4)b",4,4,3]
[{"$nulls":15},"Laminated glass ","LG",4,"5+0,1(LH-4)b",4,4,3]
["Thickness (Stress)",{"$nulls":5},"tr","mm",{"$f":"'main Side windows 14'!D33","v":{"$error":"#DIV/0!"}},"7.1.1",{"$nulls":5},"All mahogany plywood ","AMPW",2,"8+0,1(LH-4)",6,5,4]
["Thickness (Deflection)",{"$nulls":5},"tf","mm",{"$f":"'main Side windows 14'!D34","v":{"$error":"#DIV/0!"}},"7.1.2",{"$nulls":5},"GRP mat 30 % glass ","GRP M30",2,"4+0,1(LH-4)",3,3,2]
["Thickness",{"$nulls":6},"mm",{"$f":"'main Side windows 14'!D35","v":{"$error":"#DIV/0!"}},{"$nulls":6},"GRP mat/roving 35 % glass ","GRP M35",2,"4+0,1(LH-4)",3,3,2]
["Thickness minimu, techn. ",{"$nulls":5},"tm","mm",{"$f":"'main Side windows 14'!D36","v":{"$error":"#DIV/0!"}},"7.8",{"$nulls":5},"Aluminium alloy 5083-H111 ","AL 5038",2,"3+0,05 (LH-4)",3,3,2]
["Thickness minimum, Tab 5",{"$nulls":6},"mm",{"$f":"'main Side windows 14'!D37","v":{"v":0,"d":"0.0"}},"Table 5",{"$nulls":5},"Mild steel ","MS",2,"2,5+0,025 (LH-4)",2.5,2.5,2]
[]
["Required plate thickness",{"$nulls":6},"mm",{"$f":"'main Side windows 14'!I31","v":{"$error":"#DIV/0!"}}]
["Requirements fullfilled?",{"$nulls":7},{"$f":"IF(L13=\"short side in area I max 300mm\",\"FAIL\",IF(I25>=I44,\"PASS\",\"FAIL\"))","v":{"$error":"#DIV/0!"}}]

{"sheet":"main Side windows 14","index":44,"n_rows":43,"n_cols":24,"rows_kept":43,"hidden":true,"merged":[[0,0,0,5],[1,0,1,5],[25,11,28,18],[26,6,26,7]]}
[{"$nulls":6},"manufacturer"]
[{"$nulls":6},"model name"]
["Eingabe","Version 1.2.2 / 15-03-2006 rev 060512/070507/dew 090918",{"$nulls":4},"ISO/FDIS 12216:2002(E)"]
["Parameter Input","SSign","Item/Unit",{"$nulls":18},"Lists"]
["form of plate Rectangular/Circle",null,"R/C",{"$f":"'Worksheet 14'!AE9","v":""},{"$f":"IF(D5=\"\",\"Input R oder C\",\"\")","v":"Input R oder C"},null,"Material Properties see table F.1 and Tab. 5",{"$nulls":14},"R","I","A"]
["long side","a","mm",{"$f":"'Worksheet 14'!I9","v":0},{"$f":"IF(AND(D5=\"R\",D6=\"\"),\"Input a requested\",IF(AND(D5=\"C\",D6=\"\"),\"Input d requested\",\"\"))","v":""},null,"Table F.1 mechanical properties [Mpa]",null,null,"Tab. 5",{"$nulls":11},"C","IIa","B"]
["unsupported short side","b","mm",{"$f":"'Worksheet 14'!I10","v":0},{"$f":"IF(AND(D5=\"R\",D7=\"\"),\"Input b requested\",IF(AND(D5=\"C\",D7=\"\"),\"Input d requested\",\"\"))","v":""},null,"Material","strength","elasticity","safety",{"$nulls":12},"IIb","C"]
["diameter","d","mm",{"$f":"'Worksheet 14'!I11","v":0},{"$f":"IF(AND(D5=\"C\",D8=\"\"),\"Input d requested\",\"\")","v":""},null,"PMMA",110,3000,3.5,{"$nulls":3},"AG",40,72600,4,{"$nulls":5},"III","D"]
["curve height","c","mm",{"$f":"'Worksheet 14'!I12","v":0},"optional",null,"PC",90,2400,3.5,{"$nulls":3},"AISI 316 L",510,200000,2,{"$nulls":4},"SF","IV"]
["support SemiFixed/Simple Supp.",null,"SF/SS",{"$f":"'Worksheet 14'!AE13","v":"SS"},{"$f":"IF(D10=\"\",\"Input SF or SS\",\"\")","v":""},null,"TG",200,72600,4,null,null,"6.1","AL 5038",280,70000,2,{"$nulls":4},"SS"]
["Location type",null,"I/IIA/IIB/III/IV",{"$f":"'Worksheet 14'!I14","v":{"v":0,"d":"0.00"}},{"$f":"IF(D11=\"\",\"Input I / IIa,b / III / IV\",\"\")","v":""},null,"CG",300,72600,4,null,null,"3.17.1-4","AMPW",50,7000,2]
["Location area (only loc. III)",null,"F/S/A",{"$f":"'Worksheet 14'!AE16","v":""},{"$f":"IF(D12=\"F\",\"\",IF(D12=\"S\",\"\",IF(D12=\"A\",\"\",IF(D11=\"III\",\"Input F / S / A\",\"\"))))","v":""},null,"AG",40,72600,4,{"$nulls":3},"CG",300,72600,4,{"$nulls":4},"F","Any","yes"]
["Design Category",null,"A/B/C/D",{"$f":"IF('Worksheet 14'!I16=\"\",\"\",'Worksheet 14'!I16)","v":{"v":0,"d":"0.00"}},{"$f":"IF(D13=\"\",\"Input A / B / C / D\",\"\")","v":""},null,"AMPW",50,7000,2,{"$nulls":3},"GRP M30",140,7500,2,{"$nulls":4},"S","M","no"]
["Craft Type Any/Motor/Sail",null,"Any/M/S",{"$f":"'Worksheet 14'!AE18","v":""},{"$f":"IF(D14=\"\",\"Input Any / M / S\",\"\")","v":"Input Any / M / S"},null,"GRP M30",140,7500,2,{"$nulls":3},"GRP M35",175,10000,2,{"$nulls":4},"A","S"]
["optional: craft length of hull",null,"m",{"$f":"'Worksheet 14'!I18","v":{"v":0,"d":"0.00"}},"default, change if smaller",null,"GRP M35",175,10000,2,{"$nulls":3},"MS",400,200000,2]
[{"$nulls":6},"AL 5038",280,70000,2,{"$nulls":3},"PC",90,2400,3.5]
["Material",null,"see Tab. F.1",{"$f":"'Worksheet 14'!I19","v":{"v":0,"d":"0.00"}},{"$f":"IF(D17=\"\",\"manual input requ\",\"\")","v":""},null,"MS",400,200000,2,{"$nulls":3},"PMMA",110,3000,3.5]
["  ultimate flexural strength","Sigma u",null,{"$f":"LOOKUP(D17,N8:N18,O8:O18)","v":{"$error":"#N/A"}},"falls nicht in F.1 ",null,"AISI 316 L",510,200000,2,{"$nulls":3},"TG",200,72600,4]
["  modulus of elasticity","E",null,{"$f":"LOOKUP(D17,N8:N18,P8:P18)","v":{"$error":"#N/A"}},"Werte manuell"]
["  safety factor","gamma",null,{"$f":"LOOKUP(D17,N8:N18,Q8:Q18)","v":{"$error":"#N/A"}},"eintragen"]
[]
["Results for non-stiffened plates"]
["press reduction factor",null,null,{"$f":"IF(D5=\"R\",1.102-0.0004*D7,IF(D5=\"C\",1.102-0.0004*D8))","v":false},"(7.5)"]
["              within limits 0,33 and 1,0","psi",null,{"$f":"IF(D23<0.33,0.33,IF(D23>1,1,D23))","v":{"v":1,"d":"1.000"}},"(7.5)"]
["basic design press","p","KPa",{"$f":"'basic design pressure 14'!G43","v":{"v":1,"d":"1.00"}},"(7.4)",null,"see work sheet \"basic design press\""]
["allowable flexural stress","Sigma a","MPa",{"$f":"D18/D20","v":{"$error":"#N/A"}},"(7.8)",null,"is actual plate a sandwich?",null,{"$f":"'Worksheet 14'!I23","v":0},null,null,{"$f":"IF(I26=\"YES\",\"the difference in thickness between any two glass plies must be less than or equal to 2 mm and the thickness of the plastic interlayer must be less than, or equal to 0,76 mm for these conditions !\",\"\")","v":""}]
["curvature coefficient","kc",null,{"$f":"IF(D5=\"C\",1-(D9/D8),1-(D9/D7))","v":{"$error":"#DIV/0!"}},"(7.6)",null,{"$f":"IF(I26=\"yes\", \"number of layers?\",\"\")","v":""},null,{"$f":"IF('Worksheet 14'!I24=\"\",\"\",'Worksheet 14'!I24)","v":0}]
["              a/b real  (valid ≤ 5)",null,null,{"$f":"IF(D5=\"C\",1,D6/D7)","v":{"$error":"#DIV/0!"}},"(7.3) Annex G.2"]
["              a/b corrected",null,null,{"$f":"IF(D28>5,5,D28)","v":{"$error":"#DIV/0!"}},"(7.3) Annex G.2"]
["plate aspect ratio coeff stress","kr",null,{"$f":"IF(D5=\"R\",IF(D10=\"SF\",(0.62165*D29^2-0.6473*D29+0.26481)/(D29^2-1.173*D29+0.97671),IF(D10=\"SS\",(0.69952*D29^2+0.02662*D29-0.0735)/(D29^2-0.7185*D29+1.98925),\"Fehler\")),IF(D5=\"C\",IF(D10=\"SF\",0.248,0.309),\"FALSCH\"))","v":"FALSCH"},"(7.3) Annex G.2",null,"actual plate Thickness",null,{"$f":"'Worksheet 14'!I25","v":0},"mm",null,{"$f":"IF(I26=\"yes\", \"=sum of all plies\",\"\")","v":""}]
["pate aspect ratio coeff deflection","kf",null,{"$f":"IF(D5=\"R\",IF(D10=\"SF\",(0.08052*D29^2-0.0272*D29-0.0019)/(D29^2-0.9275*D29+1.70018),IF(D10=\"SS\",(0.12915*D29^2+0.00868*D29-0.0293)/(D29^2-0.887*D29+2.3372),\"Fehler\")),IF(D5=\"C\",IF(D10=\"SF\",0.027,0.043)))","v":false},"(7.3) Annex G.2",null,"required plate thickness",null,{"$f":"IF(AND(I26=\"Yes\",I27=\"\"),\"please enter number of layers\",IF(AND(I26=\"Yes\",I27>2),1.5*MAX(D35:D37),IF(AND(I26=\"Yes\",I27=2),1.2*MAX(D35:D37),IF(I36=\"Yes\",MAX(D36:D37),MAX(D35:D37)))))","v":{"$error":"#DIV/0!"}}]
[{"$nulls":6},"requirements fulfilled?",null,{"$f":"IF(I30=\"\",\"\",IF(I30>=I31,\"PASS\",\"FAIL\"))","v":{"$error":"#DIV/0!"}}]
["Thickness (Stress)","tr","mm",{"$f":"IF(D5=\"C\",D8*D27*SQRT(D30*D24*D25/D26/1000),D7*D27*SQRT(D30*D24*D25/D26/1000))","v":{"$error":"#DIV/0!"}},"(7.1.1)"]
["Thickness (Deflection)","tf","mm",{"$f":"0.45*(D33+D7*D27*POWER((D31*D24*D25/0.02/D19/1000),0.33333))","v":{"$error":"#DIV/0!"}},"(7.1.2)"]
["Thickness",null,null,{"$f":"ROUND(MAX(D33:D34),2)","v":{"$error":"#DIV/0!"}},"(7.1.7)",{"$nulls":3},"Minimum tech used???"]
["Thickness minimu, techn. ",null,"mm",{"$f":"D35-0.5","v":{"$error":"#DIV/0!"}},null,null," = Minimum, absolute",null,{"$f":"Summary!P22","v":0}]
["Thickness minimum, Tab 5","tm","mm",{"$f":"'basic design pressure 14'!J48","v":{"v":0,"d":"0.0"}},"(Tab. 5)",null,"(only PMMA, PC, TG, LG)"]
[]
["Escape Hatch possible ?"]
["Required ISO 9094-1, 2"]
["Circular: inner Diam > 450 mm",null,null,{"$f":"IF(D5=\"C\",IF(D8>450,\"pass\",\"fail\"),\"n.a.\")","v":"n.a."}]
["Rectang: inner Diam > 380 mm",null,null,{"$f":"IF(D5=\"R\",IF(MAX(D6:D7)>380,\"pass\",\"fail\"),\"n.a.\")","v":"n.a."}]
["              Area > 180000 mm²",null,null,{"$f":"IF(D5=\"R\",IF(D6*D7>180000,\"pass\",\"fail\"),\"n.a.\")","v":"n.a."}]

{"sheet":"basic design pressure 14","index":45,"n_rows":193,"n_cols":10,"rows_kept":193,"hidden":true}
["Basic design pressure",null,null,"(7.4 Table 4)"]
[]
["location",null,{"$f":"'main Side windows 14'!D11","v":0}]
["particular",null,{"$f":"IF(AND(C5=\"C\",C6=\"M\",C3=\"III\"),\"A\",'main Side windows 14'!D12)","v":""},null,"Remark: f=front, s=side"]
["design cat",null,{"$f":"'main Side windows 14'!D13","v":0}]
["craft type",null,{"$f":"'main Side windows 14'!D14","v":""},{"$f":"IF(C6=\"Any\",\"S\",C6)","v":""},"Remark: if craft type = Any, set craft type = S"]
[]
[]
["Tabelle 4",null,"location","craft type","design cat","particular","pressure"]
[null,null,"I","Any","Any","Any",70]
[null,null,"IIB","Any","A","Any",70]
[null,null,"IIB","Any","B","Any",50]
[null,null,"IIB","Any","C","Any",28]
[null,null,"IIB","Any","D","Any",28]
[null,null,"IIA","Any","Any","Any",28]
[null,null,"III","S","A","Any",18]
[null,null,"III","S","B","Any",18]
[null,null,"III","S","C","Any",12]
[null,null,"III","S","D","Any",12]
[null,null,"III","M","A","Front",12]
[null,null,"III","M","A","Any",12]
[null,null,"III","M","B","Front",9]
[null,null,"III","M","B","Any",9]
[null,null,"III","M","D","Front",6,null,null,"Korrektur, Zeile eingefügt um Fehler bei eingabe III, M, Front, D zu beheben"]
[null,null,"III","M","A","Side",9]
[null,null,"III","M","B","Side",6]
[null,null,"III","M","C","Any",6]
[null,null,"III","M","D","Any",6]
[null,null,"IV","S","Any","Any",12]
[null,null,"IV","M","Any","Any",6]
[]
["Ergebnis"]
[null,"location = I",{"$nulls":4},{"$f":"IF(C3=\"I\",G10,0)","v":0}]
[null,"location = IIB",{"$nulls":4},{"$f":"IF(C3=\"IIB\",VLOOKUP(C5,E11:G15,3),0)","v":0}]
[null,"location = IIA",{"$nulls":4},{"$f":"IF(C3=\"IIA\",VLOOKUP(C3,E11:G15,3),0)","v":0}]
[null,"location = III","craft = S",{"$nulls":3},{"$f":"IF(AND(C3=\"III\",D6=\"S\"),VLOOKUP(C5,E16:G19,3),0)","v":0}]
[null,"location = III","craft = M","particular = front",null,null,{"$f":"IF(AND(C3=\"III\",D6=\"M\",C4=\"F\"),VLOOKUP(C5,E20:G24,3),0)","v":0}]
[null,"location = III","craft = M","particular = any",null,null,{"$f":"IF(AND(OR(C5=\"A\",C5=\"B\"),C3=\"III\",D6=\"M\",C4=\"A\"),VLOOKUP(C5,E20:G24,3),0)","v":0}]
[null,"location = III","craft = M","particular = side",null,null,{"$f":"IF(AND(C3=\"III\",C6=\"M\",C4=\"S\"),IF(C5=\"A\",9,IF(C5=\"B\",6,0)))","v":false}]
[null,"location = III","craft = M",{"$nulls":3},{"$f":"IF(C5=\"A\",0,IF(C5=\"B\",0,IF(AND(C3=\"III\",C6=\"M\"),VLOOKUP(C5,E27:G28,3))))","v":false}]
[null,"location = IV",{"$nulls":4},{"$f":"IF(C3=\"IV\",VLOOKUP(D6,D29:G30,4,0),1)","v":1}]
[]
["pressure",{"$nulls":5},{"$f":"MAX(G33:G41)","v":1}]
[]
[]
["minimum thickness"]
[]
[null,"Area",{"$f":"IF(OR('main Side windows 14'!D11=\"IIA\",'main Side windows 14'!D11=\"IIB\"),\"II\",'main Side windows 14'!D11)","v":0},{"$nulls":4},"minimum thickness",null,{"$f":"MAX(J50:J190)","v":0}]
[]
[null,null,"PMMA","A","I",{"$f":" IF('main Side windows 14'!$D$15>0,6 + 0.1*('main Side windows 14'!$D$15-4),\"\")","v":""},{"$nulls":3},{"$f":"IF('main Side windows 14'!$D$17=\"PMMA\",(IF('main Side windows 14'!$D$13=\"A\",VLOOKUP($C$48,$E$50:$F$53,2,-1),0)),0)","v":0}]
["Table 5",{"$nulls":3},"II",6]
[{"$nulls":4},"III",5]
[{"$nulls":4},"IV",5]
[null,null,"PMMA","B","I",{"$f":" IF('main Side windows 14'!$D$15>0,6 + 0.1*('main Side windows 14'!$D$15-4),\"\")","v":""},{"$nulls":3},{"$f":"IF('main Side windows 14'!$D$17=\"PMMA\",(IF('main Side windows 14'!$D$13=\"B\",VLOOKUP($C$48,$E$54:$F$57,2,-1),0)),0)","v":0}]
[{"$nulls":4},"II",6]
[{"$nulls":4},"III",5]
[{"$nulls":4},"IV",5]
[null,null,"PMMA","C","I",{"$f":" IF('main Side windows 14'!$D$15>0,6 + 0.1*('main Side windows 14'!$D$15-4),\"\")","v":""},{"$nulls":3},{"$f":"IF('main Side windows 14'!$D$17=\"PMMA\",(IF('main Side windows 14'!$D$13=\"C\",VLOOKUP($C$48,$E$58:$F$61,2,-1),0)),0)","v":0}]
[{"$nulls":4},"II",6]
[{"$nulls":4},"III",4]
[{"$nulls":4},"IV",4]
[null,null,"PMMA","D","I",{"$f":" IF('main Side windows 14'!$D$15>0,6 + 0.1*('main Side windows 14'!$D$15-4),\"\")","v":""},{"$nulls":3},{"$f":"IF('main Side windows 14'!$D$17=\"PMMA\",(IF('main Side windows 14'!$D$13=\"D\",VLOOKUP($C$48,E62:F65,2,-1),0)),0)","v":0}]
[{"$nulls":4},"II",6]
[{"$nulls":4},"III",4]
[{"$nulls":4},"IV",4]
[null,null,"PC","A","I",{"$f":" IF('main Side windows 14'!$D$15>0,6 + 0.1*('main Side windows 14'!$D$15-4),\"\")","v":""},{"$nulls":3},{"$f":"IF('main Side windows 14'!$D$17=\"PC\",(IF('main Side windows 14'!$D$13=\"A\",VLOOKUP($C$48,E66:F69,2,-1),0)),0)","v":0}]
[{"$nulls":4},"II",6]
[{"$nulls":4},"III",5]
[{"$nulls":4},"IV",5]
[null,null,"PC","B","I",{"$f":" IF('main Side windows 14'!$D$15>0,6 + 0.1*('main Side windows 14'!$D$15-4),\"\")","v":""},{"$nulls":3},{"$f":"IF('main Side windows 14'!$D$17=\"PC\",(IF('main Side windows 14'!$D$13=\"B\",VLOOKUP($C$48,E70:F73,2,-1),0)),0)","v":0}]
[{"$nulls":4},"II",6]
[{"$nulls":4},"III",5]
[{"$nulls":4},"IV",5]
[null,null,"PC","C","I",{"$f":" IF('main Side windows 14'!$D$15>0,6 + 0.1*('main Side windows 14'!$D$15-4),\"\")","v":""},{"$nulls":3},{"$f":"IF('main Side windows 14'!$D$17=\"PC\",(IF('main Side windows 14'!$D$13=\"C\",VLOOKUP($C$48,E74:F77,2,-1),0)),0)","v":0}]
[{"$nulls":4},"II",6]
[{"$nulls":4},"III",4]
[{"$nulls":4},"IV",4]
[null,null,"PC","D","I",{"$f":" IF('main Side windows 14'!$D$15>0,6 + 0.1*('main Side windows 14'!$D$15-4),\"\")","v":""},{"$nulls":3},{"$f":"IF('main Side windows 14'!$D$17=\"PC\",(IF('main Side windows 14'!$D$13=\"D\",VLOOKUP($C$48,E78:F81,2,-1),0)),0)","v":0}]
[{"$nulls":4},"II",6]
[{"$nulls":4},"III",4]
[{"$nulls":4},"IV",4]
[null,null,"TG","A","I",{"$f":" IF('main Side windows 14'!$D$15>0,5+ 0.1*('main Side windows 14'!$D$15-4),\"\")","v":""},{"$nulls":3},{"$f":"IF('main Side windows 14'!$D$17=\"TG\",(IF('main Side windows 14'!$D$13=\"A\",VLOOKUP($C$48,E82:F85,2,-1),0)),0)","v":0}]
[{"$nulls":4},"II",4]
[{"$nulls":4},"III",4]
[{"$nulls":4},"IV",4]
[null,null,"TG","B","I",{"$f":" IF('main Side windows 14'!$D$15>0,5+ 0.1*('main Side windows 14'!$D$15-4),\"\")","v":""},{"$nulls":3},{"$f":"IF('main Side windows 14'!$D$17=\"TG\",(IF('main Side windows 14'!$D$13=\"B\",VLOOKUP($C$48,E86:F89,2,-1),0)),0)","v":0}]
[{"$nulls":4},"II",4]
[{"$nulls":4},"III",4]
[{"$nulls":4},"IV",4]
[null,null,"TG","C","I",{"$f":" IF('main Side windows 14'!$D$15>0,5+ 0.1*('main Side windows 14'!$D$15-4),\"\")","v":""},{"$nulls":3},{"$f":"IF('main Side windows 14'!$D$17=\"TG\",(IF('main Side windows 14'!$D$13=\"C\",VLOOKUP($C$48,E90:F93,2,-1),0)),0)","v":0}]
[{"$nulls":4},"II",4]
[{"$nulls":4},"III",3]
[{"$nulls":4},"IV",3]
[null,null,"TG","D","I",{"$f":" IF('main Side windows 14'!$D$15>0,5+ 0.1*('main Side windows 14'!$D$15-4),\"\")","v":""},{"$nulls":3},{"$f":"IF('main Side windows 14'!$D$17=\"TG\",(IF('main Side windows 14'!$D$13=\"D\",VLOOKUP($C$48,E94:F97,2,-1),0)),0)","v":0}]
[{"$nulls":4},"II",4]
[{"$nulls":4},"III",3]
[{"$nulls":4},"IV",3]
[null,null,"LG","A","I",{"$f":" IF('main Side windows 14'!$D$15>0,5+ 0.1*('main Side windows 14'!$D$15-4),\"\")","v":""},{"$nulls":3},{"$f":"IF('main Side windows 14'!$D$17=\"LG\",(IF('main Side windows 14'!$D$13=\"A\",VLOOKUP($C$48,E98:F101,2,-1),0)),0)","v":0}]
[{"$nulls":4},"II",4]
[{"$nulls":4},"III",4]
[{"$nulls":4},"IV",4]
[null,null,"LG","B","I",{"$f":" IF('main Side windows 14'!$D$15>0,5+ 0.1*('main Side windows 14'!$D$15-4),\"\")","v":""},{"$nulls":3},{"$f":"IF('main Side windows 14'!$D$17=\"LG\",(IF('main Side windows 14'!$D$13=\"B\",VLOOKUP($C$48,E102:F105,2,-1),0)),0)","v":0}]
[{"$nulls":4},"II",4]
[{"$nulls":4},"III",4]
[{"$nulls":4},"IV",4]
[null,null,"LG","C","I",{"$f":" IF('main Side windows 14'!$D$15>0,5+ 0.1*('main Side windows 14'!$D$15-4),\"\")","v":""},{"$nulls":3},{"$f":"IF('main Side windows 14'!$D$17=\"LG\",(IF('main Side windows 14'!$D$13=\"C\",VLOOKUP($C$48,E106:F109,2,-1),0)),0)","v":0}]
[{"$nulls":4},"II",4]
[{"$nulls":4},"III",3]
[{"$nulls":4},"IV",3]
[null,null,"LG","D","I",{"$f":" IF('main Side windows 14'!$D$15>0,5+ 0.1*('main Side windows 14'!$D$15-4),\"\")","v":""},{"$nulls":3},{"$f":"IF('main Side windows 14'!$D$17=\"LG\",(IF('main Side windows 14'!$D$13=\"D\",VLOOKUP($C$48,E110:F113,2,-1),0)),0)","v":0}]
[{"$nulls":4},"II",4]
[{"$nulls":4},"III",3]
[{"$nulls":4},"IV",3]
[null,null,"AMPW","A","I",{"$f":" IF('main Side windows 14'!$D$15>0,8+ 0.1*('main Side windows 14'!$D$15-4),\"\")","v":""},{"$nulls":3},{"$f":"IF('main Side windows 14'!$D$17=\"AMPW\",(IF('main Side windows 14'!$D$13=\"A\",VLOOKUP($C$48,E114:F117,2,-1),0)),0)","v":0}]
[{"$nulls":4},"II",6]
[{"$nulls":4},"III",5]
[{"$nulls":4},"IV",5]
[null,null,"AMPW","B","I",{"$f":" IF('main Side windows 14'!$D$15>0,8+ 0.1*('main Side windows 14'!$D$15-4),\"\")","v":""},{"$nulls":3},{"$f":"IF('main Side windows 14'!$D$17=\"AMPW\",(IF('main Side windows 14'!$D$13=\"B\",VLOOKUP($C$48,E118:F121,2,-1),0)),0)","v":0}]
[{"$nulls":4},"II",6]
[{"$nulls":4},"III",5]
[{"$nulls":4},"IV",5]
[null,null,"AMPW","C","I",{"$f":" IF('main Side windows 14'!$D$15>0,8+ 0.1*('main Side windows 14'!$D$15-4),\"\")","v":""},{"$nulls":3},{"$f":"IF('main Side windows 14'!$D$17=\"AMPW\",(IF('main Side windows 14'!$D$13=\"C\",VLOOKUP($C$48,E122:F125,2,-1),0)),0)","v":0}]
[{"$nulls":4},"II",6]
[{"$nulls":4},"III",4]
[{"$nulls":4},"IV",4]
[null,null,"AMPW","D","I",{"$f":" IF('main Side windows 14'!$D$15>0,8+ 0.1*('main Side windows 14'!$D$15-4),\"\")","v":""},{"$nulls":3},{"$f":"IF('main Side windows 14'!$D$17=\"AMPW\",(IF('main Side windows 14'!$D$13=\"D\",VLOOKUP($C$48,E126:F129,2,-1),0)),0)","v":0}]
[{"$nulls":4},"II",6]
[{"$nulls":4},"III",4]
[{"$nulls":4},"IV",4]
[null,null,"GRP m30","A","I",{"$f":" IF('main Side windows 14'!$D$15>0,6 + 0.1*('main Side windows 14'!$D$15-4),\"\")","v":""},{"$nulls":3},{"$f":"IF('main Side windows 14'!$D$17=\"GRP M30\",(IF('main Side windows 14'!$D$13=\"A\",VLOOKUP($C$48,E130:F133,2,-1),0)),0)","v":0}]
[{"$nulls":4},"II",3]
[{"$nulls":4},"III",3]
[{"$nulls":4},"IV",3]
[null,null,"GRP m30","B","I",{"$f":" IF('main Side windows 14'!$D$15>0,6 + 0.1*('main Side windows 14'!$D$15-4),\"\")","v":""},{"$nulls":3},{"$f":"IF('main Side windows 14'!$D$17=\"GRP M30\",(IF('main Side windows 14'!$D$13=\"B\",VLOOKUP($C$48,E134:F137,2,-1),0)),0)","v":0}]
[{"$nulls":4},"II",3]
[{"$nulls":4},"III",3]
[{"$nulls":4},"IV",3]
[null,null,"GRP m30","C","I",{"$f":" IF('main Side windows 14'!$D$15>0,6 + 0.1*('main Side windows 14'!$D$15-4),\"\")","v":""},{"$nulls":3},{"$f":"IF('main Side windows 14'!$D$17=\"GRP M30\",(IF('main Side windows 14'!$D$13=\"C\",VLOOKUP($C$48,E138:F141,2,-1),0)),0)","v":0}]
[{"$nulls":4},"II",3]
[{"$nulls":4},"III",2]
[{"$nulls":4},"IV",2]
[null,null,"GRP m30","D","I",{"$f":" IF('main Side windows 14'!$D$15>0,6 + 0.1*('main Side windows 14'!$D$15-4),\"\")","v":""},{"$nulls":3},{"$f":"IF('main Side windows 14'!$D$17=\"GRP M30\",(IF('main Side windows 14'!$D$13=\"D\",VLOOKUP($C$48,E142:F145,2,-1),0)),0)","v":0}]
[{"$nulls":4},"II",3]
[{"$nulls":4},"III",2]
[{"$nulls":4},"IV",2]
[null,null,"GRP m35","A","I",{"$f":" IF('main Side windows 14'!$D$15>0,6 + 0.1*('main Side windows 14'!$D$15-4),\"\")","v":""},{"$nulls":3},{"$f":"IF('main Side windows 14'!$D$17=\"GRP M35\",(IF('main Side windows 14'!$D$13=\"A\",VLOOKUP($C$48,E146:F149,2,-1),0)),0)","v":0}]
[{"$nulls":4},"II",3]
[{"$nulls":4},"III",3]
[{"$nulls":4},"IV",3]
[null,null,"GRP m35","B","I",{"$f":" IF('main Side windows 14'!$D$15>0,6 + 0.1*('main Side windows 14'!$D$15-4),\"\")","v":""},{"$nulls":3},{"$f":"IF('main Side windows 14'!$D$17=\"GRP M35\",(IF('main Side windows 14'!$D$13=\"B\",VLOOKUP($C$48,E150:F153,2,-1),0)),0)","v":0}]
[{"$nulls":4},"II",3]
[{"$nulls":4},"III",3]
[{"$nulls":4},"IV",3]
[null,null,"GRP m35","C","I",{"$f":" IF('main Side windows 14'!$D$15>0,6 + 0.1*('main Side windows 14'!$D$15-4),\"\")","v":""},{"$nulls":3},{"$f":"IF('main Side windows 14'!$D$17=\"GRP M35\",(IF('main Side windows 14'!$D$13=\"C\",VLOOKUP($C$48,E154:F157,2,-1),0)),0)","v":0}]
[{"$nulls":4},"II",3]
[{"$nulls":4},"III",2]
[{"$nulls":4},"IV",2]
[null,null,"GRP m35","D","I",{"$f":" IF('main Side windows 14'!$D$15>0,6 + 0.1*('main Side windows 14'!$D$15-4),\"\")","v":""},{"$nulls":3},{"$f":"IF('main Side windows 14'!$D$17=\"GRP M35\",(IF('main Side windows 14'!$D$13=\"D\",VLOOKUP($C$48,E158:F161,2,-1),0)),0)","v":0}]
[{"$nulls":4},"II",3]
[{"$nulls":4},"III",2]
[{"$nulls":4},"IV",2]
[null,null,"Al 5038","A","I",{"$f":" IF('main Side windows 14'!$D$15>0,3 + 0.05*('main Side windows 14'!$D$15-4),\"\")","v":""},{"$nulls":3},{"$f":"IF('main Side windows 14'!$D$17=\"Al 5038\",(IF('main Side windows 14'!$D$13=\"A\",VLOOKUP($C$48,E162:F165,2,-1),0)),0)","v":0}]
[{"$nulls":4},"II",3]
[{"$nulls":4},"III",3]
[{"$nulls":4},"IV",3]
[null,null,"Al 5038","B","I",{"$f":" IF('main Side windows 14'!$D$15>0,3 + 0.05*('main Side windows 14'!$D$15-4),\"\")","v":""},{"$nulls":3},{"$f":"IF('main Side windows 14'!$D$17=\"AL 5038\",(IF('main Side windows 14'!$D$13=\"B\",VLOOKUP($C$48,E166:F169,2,-1),0)),0)","v":0}]
[{"$nulls":4},"II",3]
[{"$nulls":4},"III",3]
[{"$nulls":4},"IV",3]
[null,null,"Al 5038","C","I",{"$f":" IF('main Side windows 14'!$D$15>0,3 + 0.05*('main Side windows 14'!$D$15-4),\"\")","v":""},{"$nulls":3},{"$f":"IF('main Side windows 14'!$D$17=\"AL 5038\",(IF('main Side windows 14'!$D$13=\"C\",VLOOKUP($C$48,E170:F173,2,-1),0)),0)","v":0}]
[{"$nulls":4},"II",3]
[{"$nulls":4},"III",2]
[{"$nulls":4},"IV",2]
[null,null,"Al 5038","D","I",{"$f":" IF('main Side windows 14'!$D$15>0,3 + 0.05*('main Side windows 14'!$D$15-4),\"\")","v":""},{"$nulls":3},{"$f":"IF('main Side windows 14'!$D$17=\"AL 5038\",(IF('main Side windows 14'!$D$13=\"D\",VLOOKUP($C$48,E174:F177,2,-1),0)),0)","v":0}]
[{"$nulls":4},"II",3]
[{"$nulls":4},"III",2]
[{"$nulls":4},"IV",2]
[null,null,"MS","A","I",{"$f":" IF('main Side windows 14'!$D$15>0,2.5 + 0.025*('main Side windows 14'!$D$15-4),\"\")","v":""},{"$nulls":3},{"$f":"IF('main Side windows 14'!$D$17=\"MS\",(IF('main Side windows 14'!$D$13=\"A\",VLOOKUP($C$48,E178:F181,2,-1),0)),0)","v":0}]
[{"$nulls":4},"II",2.5]
[{"$nulls":4},"III",2.5]
[{"$nulls":4},"IV",2.5]
[null,null,"MS","B","I",{"$f":" IF('main Side windows 14'!$D$15>0,2.5 + 0.025*('main Side windows 14'!$D$15-4),\"\")","v":""},{"$nulls":3},{"$f":"IF('main Side windows 14'!$D$17=\"MS\",(IF('main Side windows 14'!$D$13=\"B\",VLOOKUP($C$48,E182:F185,2,-1),0)),0)","v":0}]
[{"$nulls":4},"II",2.5]
[{"$nulls":4},"III",2.5]
[{"$nulls":4},"IV",2.5]
[null,null,"MS","C","I",{"$f":" IF('main Side windows 14'!$D$15>0,2.5 + 0.025*('main Side windows 14'!$D$15-4),\"\")","v":""},{"$nulls":3},{"$f":"IF('main Side windows 14'!$D$17=\"MS\",(IF('main Side windows 14'!$D$13=\"C\",VLOOKUP($C$48,E186:F189,2,-1),0)),0)","v":0}]
[{"$nulls":4},"II",2.5]
[{"$nulls":4},"III",2.5]
[{"$nulls":4},"IV",2.5]
[null,null,"MS","D","I",{"$f":" IF('main Side windows 14'!$D$15>0,2.5 + 0.025*('main Side windows 14'!$D$15-4),\"\")","v":""},{"$nulls":3},{"$f":"IF('main Side windows 14'!$D$17=\"MS\",(IF('main Side windows 14'!$D$13=\"D\",VLOOKUP($C$48,E190:F193,2,-1),0)),0)","v":0}]
[{"$nulls":4},"II",2.5]
[{"$nulls":4},"III",2.5]
[{"$nulls":4},"IV",2.5]

{"sheet":"Worksheet 15","index":46,"n_rows":45,"n_cols":31,"rows_kept":45,"merged":[[0,0,0,9],[0,11,0,12],[1,0,1,9],[2,0,2,9],[4,0,4,9],[6,0,6,5],[17,13,17,14],[19,13,19,14],[21,12,21,14],[22,15,26,18],[27,6,28,6],[27,7,28,7],[27,15,27,21],[29,15,32,15],[29,16,32,16],[29,17,32,17],[29,18,29,21],[30,18,30,21],[31,18,31,19],[32,11,32,13],[34,13,34,14],[36,13,36,14],[38,13,38,14],[39,13,39,14],[41,13,41,14]]}
[{"$nulls":11},"Comments"]
["ISO 12216:2020 - Small craft - Windows, portlights, hatches, deadlights and doors",{"$nulls":11},"Derived values"]
["WORKSHEET No. 1 data entry",{"$nulls":11},"Input values"]
[]
[{"$f":"CONCATENATE(coverSheet!B5,\"   \",coverSheet!B12,\"   \",Summary!B23)","v":"      "}]
[]
["Parameter",{"$nulls":5},"Symbol","Unit","Value","Ref.",{"$nulls":5},"Material Properties see table F.1 and Tab. 5",{"$nulls":11},"List"]
["Form of plate (Rectangular / Circle)",{"$nulls":5},"R / C",null,{"$f":"Summary!C23","v":0},"Annex C",{"$nulls":5},"Table F.1 mechanical properties [MPa]",null,null,"Tab. 5",{"$nulls":8},"Lists"]
["Long side",{"$nulls":5},"a","mm",{"$f":"Summary!D23","v":0},"7.3, Annex C",{"$nulls":5},"Material","strength","elasticity","safety",{"$nulls":7},"rectangular","R","I","A",{"$f":"IF(I8=\"rectangular\",\"R\",IF(I8=\"circle\",\"C\",\"\"))","v":""}]
["Unsupported short side",{"$nulls":5},"b","mm",{"$f":"Summary!E23","v":0},"7.3, Annex C",{"$nulls":5},"PMMA",110,3000,3.5,{"$nulls":7},"circle","C","IIa","B"]
["Diameter",{"$nulls":5},"d","mm",{"$f":"Summary!F23","v":0},"7.3, Annex C",{"$nulls":5},"PC",90,2400,3.5,{"$nulls":9},"IIb","C"]
["Curve height",{"$nulls":5},"c","mm",{"$f":"Summary!G23","v":0},"7.6",{"$nulls":5},"TG",200,72600,4,{"$nulls":9},"III","D"]
["Support SemiFixed / Simply Supported",{"$nulls":5},"SF / SS",null,{"$f":"Summary!H23","v":0},"3.18",{"$nulls":5},"CG",300,72600,4,{"$nulls":7},"semi-fixed","SF","IV",null,{"$f":"IF(I13=\"semi-fixed\",\"SF\",IF(I13=\"\",\"\",\"SS\"))","v":"SS"}]
["Location type",{"$nulls":5},"I/IIA/IIB/III/IV",null,{"$f":"Summary!I23","v":0},"3.17; Annex A",{"$nulls":5},"AG",40,72600,4,{"$nulls":7},"simply supported","SS"]
["Location area (only loc. III)",{"$nulls":5},"F / S / Any",null,{"$f":"Summary!J23","v":0},"3.17.4",{"$nulls":5},"AMPW",50,7000,2]
["Design Category",{"$nulls":5},"A / B / C / D",null,{"$f":"Summary!K23","v":0},"3.12",{"$nulls":5},"GRP M30",140,7500,2,{"$nulls":6},"any","front","F","Any","yes",{"$f":"IF(I15=\"front\",\"F\",IF(I15=\"side\",\"S\",IF(I15=\"any\",\"A\",\"\")))","v":""}]
["Craft Type Any/Motor/Sail",{"$nulls":5},"Any / M / S",null,{"$f":"Summary!L23","v":0},{"$nulls":6},"GRP M35",175,10000,2,{"$nulls":6},"motor","side","S","M","no"]
["Length of hull as in ISO 8666",{"$nulls":5},"LH","m",{"$f":"Summary!N23","v":{"v":0,"d":"0.00"}},"3.16",{"$nulls":5},"AL 5038",280,70000,2,{"$nulls":6},"sail","any","Any","S",null,{"$f":"IF(I17=\"any\",\"Any\",IF(I17=\"motor\",\"M\",IF(I17=\"sail\",\"S\",\"\")))","v":""}]
["Material data",{"$nulls":7},{"$f":"Summary!O23","v":0},"Table F.1 & 5",{"$nulls":5},"MS",400,200000,2]
[null,"  Ultimate flexural strength",{"$nulls":4},"σU","MPa",{"$f":"'main Side windows 15'!D18","v":{"$error":"#N/A"}},"Table F.1 & 5",{"$nulls":5},"AISI 316 L",510,200000,2]
[null,"  Modulus of elasticity",{"$nulls":4},"E","MPa",{"$f":"'main Side windows 15'!D19","v":{"$error":"#N/A"}},"Table F.1 & 5"]
[null,"  Safety factor",{"$nulls":4},"gamma",". / .",{"$f":"'main Side windows 15'!D20","v":{"$error":"#N/A"}},"Table F.1 & 5",{"$nulls":15},"yes"]
["Is actual plate a sandwich?",{"$nulls":5},"yes / no",null,{"$f":"Summary!Q23","v":0},"7.9",{"$nulls":5},{"$f":"IF(I23=\"YES\",\"The difference in thickness between any two glass plies must be less than or equal to 2 mm and the thickness of the plastic interlayer must be less than, or equal to 0,76 mm for these conditions !\",\"\")","v":""},{"$nulls":9},"no"]
[null,"If yes, enter number of layers",{"$nulls":5},". / .",{"$f":"Summary!R23","v":0},"7.9"]
["Actual plate thickness (in case of sandwich the sum of all layers)",{"$nulls":6},"mm",{"$f":"Summary!U23","v":{"v":0,"d":"0.00"}}]
[]
["Results for non-stiffened plates"]
["Press reduction factor",{"$nulls":5},"Ψ",". / .",{"$f":"'main Side windows 15'!D23","v":false},"7.5"]
["              within limits 0,33 and 1,0",{"$nulls":7},{"$f":"'main Side windows 15'!D24","v":1},"7.5",{"$nulls":5},"Table 5 — Safety factor and minimum thickness of monolithic plates"]
["Basic design press",{"$nulls":5},"p","kPa",{"$f":"'main Side windows 15'!D25","v":1},"7.4",{"$nulls":5},"Material","Acronym","Safety factor\n γ ","Minimum thickness of monolithic plates, tm"]
["Allowable flexural stress",{"$nulls":5},"σa","MPa",{"$f":"'main Side windows 15'!D26","v":{"$error":"#N/A"}},"7.8",{"$nulls":8},"Design categories "]
["Curvature coefficient",{"$nulls":5},"kC",". / .",{"$f":"'main Side windows 15'!D27","v":{"$error":"#DIV/0!"}},"7.6",{"$nulls":8},"Any",null,"A & B","C & D"]
["Ratio a/b (valid ≤ 5)",{"$nulls":6},". / .",{"$f":"'main Side windows 15'!D28","v":{"$error":"#DIV/0!"}},"7.3, Annex G.2",{"$nulls":8},"Area Ia","Area II","Area III & IV","Area III & IV"]
["Ratio a/b corrected",{"$nulls":6},". / .",{"$f":"'main Side windows 15'!D29","v":{"$error":"#DIV/0!"}},"7.3, Annex G.2",{"$nulls":5},"Poly(methyl)methacrylate","PMMA",3.5,"6+0,1(LH-4)",6,5,4]
["Plate aspect ratio coeff stress",{"$nulls":5},"kr",". / .",{"$f":"'main Side windows 15'!D30","v":"FALSCH"},"7.3, Annex G.2",{"$nulls":5},"Polycarbonate","PC",3.5,"6+0,1(LH-4)",6,5,4]
["Pate aspect ratio coeff deflection",{"$nulls":5},"kf",". / .",{"$f":"'main Side windows 15'!D31","v":false},"7.3, Annex G.2",{"$nulls":5},"Monolithic tempered glass ","TG",4,"5+0,1(LH-4)b",4,4,3]
[{"$nulls":15},"Laminated glass ","LG",4,"5+0,1(LH-4)b",4,4,3]
["Thickness (Stress)",{"$nulls":5},"tr","mm",{"$f":"'main Side windows 15'!D33","v":{"$error":"#DIV/0!"}},"7.1.1",{"$nulls":5},"All mahogany plywood ","AMPW",2,"8+0,1(LH-4)",6,5,4]
["Thickness (Deflection)",{"$nulls":5},"tf","mm",{"$f":"'main Side windows 15'!D34","v":{"$error":"#DIV/0!"}},"7.1.2",{"$nulls":5},"GRP mat 30 % glass ","GRP M30",2,"4+0,1(LH-4)",3,3,2]
["Thickness",{"$nulls":6},"mm",{"$f":"'main Side windows 15'!D35","v":{"$error":"#DIV/0!"}},{"$nulls":6},"GRP mat/roving 35 % glass ","GRP M35",2,"4+0,1(LH-4)",3,3,2]
["Thickness minimu, techn. ",{"$nulls":5},"tm","mm",{"$f":"'main Side windows 15'!D36","v":{"$error":"#DIV/0!"}},"7.8",{"$nulls":5},"Aluminium alloy 5083-H111 ","AL 5038",2,"3+0,05 (LH-4)",3,3,2]
["Thickness minimum, Tab 5",{"$nulls":6},"mm",{"$f":"'main Side windows 15'!D37","v":{"v":0,"d":"0.0"}},"Table 5",{"$nulls":5},"Mild steel ","MS",2,"2,5+0,025 (LH-4)",2.5,2.5,2]
[]
["Required plate thickness",{"$nulls":6},"mm",{"$f":"'main Side windows 15'!I31","v":{"$error":"#DIV/0!"}}]
["Requirements fullfilled?",{"$nulls":7},{"$f":"IF(L13=\"short side in area I max 300mm\",\"FAIL\",IF(I25>=I44,\"PASS\",\"FAIL\"))","v":{"$error":"#DIV/0!"}}]

{"sheet":"main Side windows 15","index":47,"n_rows":43,"n_cols":24,"rows_kept":43,"hidden":true,"merged":[[0,0,0,5],[1,0,1,5],[25,11,28,18],[26,6,26,7]]}
[{"$nulls":6},"manufacturer"]
[{"$nulls":6},"model name"]
["Eingabe","Version 1.2.2 / 15-03-2006 rev 060512/070507/dew 090918",{"$nulls":4},"ISO/FDIS 12216:2002(E)"]
["Parameter Input","SSign","Item/Unit",{"$nulls":18},"Lists"]
["form of plate Rectangular/Circle",null,"R/C",{"$f":"'Worksheet 15'!AE9","v":""},{"$f":"IF(D5=\"\",\"Input R oder C\",\"\")","v":"Input R oder C"},null,"Material Properties see table F.1 and Tab. 5",{"$nulls":14},"R","I","A"]
["long side","a","mm",{"$f":"'Worksheet 15'!I9","v":0},{"$f":"IF(AND(D5=\"R\",D6=\"\"),\"Input a requested\",IF(AND(D5=\"C\",D6=\"\"),\"Input d requested\",\"\"))","v":""},null,"Table F.1 mechanical properties [Mpa]",null,null,"Tab. 5",{"$nulls":11},"C","IIa","B"]
["unsupported short side","b","mm",{"$f":"'Worksheet 15'!I10","v":0},{"$f":"IF(AND(D5=\"R\",D7=\"\"),\"Input b requested\",IF(AND(D5=\"C\",D7=\"\"),\"Input d requested\",\"\"))","v":""},null,"Material","strength","elasticity","safety",{"$nulls":12},"IIb","C"]
["diameter","d","mm",{"$f":"'Worksheet 15'!I11","v":0},{"$f":"IF(AND(D5=\"C\",D8=\"\"),\"Input d requested\",\"\")","v":""},null,"PMMA",110,3000,3.5,{"$nulls":3},"AG",40,72600,4,{"$nulls":5},"III","D"]
["curve height","c","mm",{"$f":"'Worksheet 15'!I12","v":0},"optional",null,"PC",90,2400,3.5,{"$nulls":3},"AISI 316 L",510,200000,2,{"$nulls":4},"SF","IV"]
["support SemiFixed/Simple Supp.",null,"SF/SS",{"$f":"'Worksheet 15'!AE13","v":"SS"},{"$f":"IF(D10=\"\",\"Input SF or SS\",\"\")","v":""},null,"TG",200,72600,4,null,null,"6.1","AL 5038",280,70000,2,{"$nulls":4},"SS"]
["Location type",null,"I/IIA/IIB/III/IV",{"$f":"'Worksheet 15'!I14","v":{"v":0,"d":"0.00"}},{"$f":"IF(D11=\"\",\"Input I / IIa,b / III / IV\",\"\")","v":""},null,"CG",300,72600,4,null,null,"3.17.1-4","AMPW",50,7000,2]
["Location area (only loc. III)",null,"F/S/A",{"$f":"'Worksheet 15'!AE16","v":""},{"$f":"IF(D12=\"F\",\"\",IF(D12=\"S\",\"\",IF(D12=\"A\",\"\",IF(D11=\"III\",\"Input F / S / A\",\"\"))))","v":""},null,"AG",40,72600,4,{"$nulls":3},"CG",300,72600,4,{"$nulls":4},"F","Any","yes"]
["Design Category",null,"A/B/C/D",{"$f":"IF('Worksheet 15'!I16=\"\",\"\",'Worksheet 15'!I16)","v":{"v":0,"d":"0.00"}},{"$f":"IF(D13=\"\",\"Input A / B / C / D\",\"\")","v":""},null,"AMPW",50,7000,2,{"$nulls":3},"GRP M30",140,7500,2,{"$nulls":4},"S","M","no"]
["Craft Type Any/Motor/Sail",null,"Any/M/S",{"$f":"'Worksheet 15'!AE18","v":""},{"$f":"IF(D14=\"\",\"Input Any / M / S\",\"\")","v":"Input Any / M / S"},null,"GRP M30",140,7500,2,{"$nulls":3},"GRP M35",175,10000,2,{"$nulls":4},"A","S"]
["optional: craft length of hull",null,"m",{"$f":"'Worksheet 15'!I18","v":{"v":0,"d":"0.00"}},"default, change if smaller",null,"GRP M35",175,10000,2,{"$nulls":3},"MS",400,200000,2]
[{"$nulls":6},"AL 5038",280,70000,2,{"$nulls":3},"PC",90,2400,3.5]
["Material",null,"see Tab. F.1",{"$f":"'Worksheet 15'!I19","v":{"v":0,"d":"0.00"}},{"$f":"IF(D17=\"\",\"manual input requ\",\"\")","v":""},null,"MS",400,200000,2,{"$nulls":3},"PMMA",110,3000,3.5]
["  ultimate flexural strength","Sigma u",null,{"$f":"LOOKUP(D17,N8:N18,O8:O18)","v":{"$error":"#N/A"}},"falls nicht in F.1 ",null,"AISI 316 L",510,200000,2,{"$nulls":3},"TG",200,72600,4]
["  modulus of elasticity","E",null,{"$f":"LOOKUP(D17,N8:N18,P8:P18)","v":{"$error":"#N/A"}},"Werte manuell"]
["  safety factor","gamma",null,{"$f":"LOOKUP(D17,N8:N18,Q8:Q18)","v":{"$error":"#N/A"}},"eintragen"]
[]
["Results for non-stiffened plates"]
["press reduction factor",null,null,{"$f":"IF(D5=\"R\",1.102-0.0004*D7,IF(D5=\"C\",1.102-0.0004*D8))","v":false},"(7.5)"]
["              within limits 0,33 and 1,0","psi",null,{"$f":"IF(D23<0.33,0.33,IF(D23>1,1,D23))","v":{"v":1,"d":"1.000"}},"(7.5)"]
["basic design press","p","KPa",{"$f":"'basic design pressure 15'!G43","v":{"v":1,"d":"1.00"}},"(7.4)",null,"see work sheet \"basic design press\""]
["allowable flexural stress","Sigma a","MPa",{"$f":"D18/D20","v":{"$error":"#N/A"}},"(7.8)",null,"is actual plate a sandwich?",null,{"$f":"'Worksheet 15'!I23","v":0},null,null,{"$f":"IF(I26=\"YES\",\"the difference in thickness between any two glass plies must be less than or equal to 2 mm and the thickness of the plastic interlayer must be less than, or equal to 0,76 mm for these conditions !\",\"\")","v":""}]
["curvature coefficient","kc",null,{"$f":"IF(D5=\"C\",1-(D9/D8),1-(D9/D7))","v":{"$error":"#DIV/0!"}},"(7.6)",null,{"$f":"IF(I26=\"yes\", \"number of layers?\",\"\")","v":""},null,{"$f":"IF('Worksheet 15'!I24=\"\",\"\",'Worksheet 15'!I24)","v":0}]
["              a/b real  (valid ≤ 5)",null,null,{"$f":"IF(D5=\"C\",1,D6/D7)","v":{"$error":"#DIV/0!"}},"(7.3) Annex G.2"]
["              a/b corrected",null,null,{"$f":"IF(D28>5,5,D28)","v":{"$error":"#DIV/0!"}},"(7.3) Annex G.2"]
["plate aspect ratio coeff stress","kr",null,{"$f":"IF(D5=\"R\",IF(D10=\"SF\",(0.62165*D29^2-0.6473*D29+0.26481)/(D29^2-1.173*D29+0.97671),IF(D10=\"SS\",(0.69952*D29^2+0.02662*D29-0.0735)/(D29^2-0.7185*D29+1.98925),\"Fehler\")),IF(D5=\"C\",IF(D10=\"SF\",0.248,0.309),\"FALSCH\"))","v":"FALSCH"},"(7.3) Annex G.2",null,"actual plate Thickness",null,{"$f":"'Worksheet 15'!I25","v":0},"mm",null,{"$f":"IF(I26=\"yes\", \"=sum of all plies\",\"\")","v":""}]
["pate aspect ratio coeff deflection","kf",null,{"$f":"IF(D5=\"R\",IF(D10=\"SF\",(0.08052*D29^2-0.0272*D29-0.0019)/(D29^2-0.9275*D29+1.70018),IF(D10=\"SS\",(0.12915*D29^2+0.00868*D29-0.0293)/(D29^2-0.887*D29+2.3372),\"Fehler\")),IF(D5=\"C\",IF(D10=\"SF\",0.027,0.043)))","v":false},"(7.3) Annex G.2",null,"required plate thickness",null,{"$f":"IF(AND(I26=\"Yes\",I27=\"\"),\"please enter number of layers\",IF(AND(I26=\"Yes\",I27>2),1.5*MAX(D35:D37),IF(AND(I26=\"Yes\",I27=2),1.2*MAX(D35:D37),IF(I36=\"Yes\",MAX(D36:D37),MAX(D35:D37)))))","v":{"$error":"#DIV/0!"}}]
[{"$nulls":6},"requirements fulfilled?",null,{"$f":"IF(I30=\"\",\"\",IF(I30>=I31,\"PASS\",\"FAIL\"))","v":{"$error":"#DIV/0!"}}]
["Thickness (Stress)","tr","mm",{"$f":"IF(D5=\"C\",D8*D27*SQRT(D30*D24*D25/D26/1000),D7*D27*SQRT(D30*D24*D25/D26/1000))","v":{"$error":"#DIV/0!"}},"(7.1.1)"]
["Thickness (Deflection)","tf","mm",{"$f":"0.45*(D33+D7*D27*POWER((D31*D24*D25/0.02/D19/1000),0.33333))","v":{"$error":"#DIV/0!"}},"(7.1.2)"]
["Thickness",null,null,{"$f":"ROUND(MAX(D33:D34),2)","v":{"$error":"#DIV/0!"}},"(7.1.7)",{"$nulls":3},"Minimum tech used???"]
["Thickness minimu, techn. ",null,"mm",{"$f":"D35-0.5","v":{"$error":"#DIV/0!"}},null,null," = Minimum, absolute",null,{"$f":"Summary!P23","v":0}]
["Thickness minimum, Tab 5","tm","mm",{"$f":"'basic design pressure 15'!J48","v":{"v":0,"d":"0.0"}},"(Tab. 5)",null,"(only PMMA, PC, TG, LG)"]
[]
["Escape Hatch possible ?"]
["Required ISO 9094-1, 2"]
["Circular: inner Diam > 450 mm",null,null,{"$f":"IF(D5=\"C\",IF(D8>450,\"pass\",\"fail\"),\"n.a.\")","v":"n.a."}]
["Rectang: inner Diam > 380 mm",null,null,{"$f":"IF(D5=\"R\",IF(MAX(D6:D7)>380,\"pass\",\"fail\"),\"n.a.\")","v":"n.a."}]
["              Area > 180000 mm²",null,null,{"$f":"IF(D5=\"R\",IF(D6*D7>180000,\"pass\",\"fail\"),\"n.a.\")","v":"n.a."}]

{"sheet":"basic design pressure 15","index":48,"n_rows":193,"n_cols":10,"rows_kept":193,"hidden":true}
["Basic design pressure",null,null,"(7.4 Table 4)"]
[]
["location",null,{"$f":"'main Side windows 15'!D11","v":0}]
["particular",null,{"$f":"IF(AND(C5=\"C\",C6=\"M\",C3=\"III\"),\"A\",'main Side windows 15'!D12)","v":""},null,"Remark: f=front, s=side"]
["design cat",null,{"$f":"'main Side windows 15'!D13","v":0}]
["craft type",null,{"$f":"'main Side windows 15'!D14","v":""},{"$f":"IF(C6=\"Any\",\"S\",C6)","v":""},"Remark: if craft type = Any, set craft type = S"]
[]
[]
["Tabelle 4",null,"location","craft type","design cat","particular","pressure"]
[null,null,"I","Any","Any","Any",70]
[null,null,"IIB","Any","A","Any",70]
[null,null,"IIB","Any","B","Any",50]
[null,null,"IIB","Any","C","Any",28]
[null,null,"IIB","Any","D","Any",28]
[null,null,"IIA","Any","Any","Any",28]
[null,null,"III","S","A","Any",18]
[null,null,"III","S","B","Any",18]
[null,null,"III","S","C","Any",12]
[null,null,"III","S","D","Any",12]
[null,null,"III","M","A","Front",12]
[null,null,"III","M","A","Any",12]
[null,null,"III","M","B","Front",9]
[null,null,"III","M","B","Any",9]
[null,null,"III","M","D","Front",6,null,null,"Korrektur, Zeile eingefügt um Fehler bei eingabe III, M, Front, D zu beheben"]
[null,null,"III","M","A","Side",9]
[null,null,"III","M","B","Side",6]
[null,null,"III","M","C","Any",6]
[null,null,"III","M","D","Any",6]
[null,null,"IV","S","Any","Any",12]
[null,null,"IV","M","Any","Any",6]
[]
["Ergebnis"]
[null,"location = I",{"$nulls":4},{"$f":"IF(C3=\"I\",G10,0)","v":0}]
[null,"location = IIB",{"$nulls":4},{"$f":"IF(C3=\"IIB\",VLOOKUP(C5,E11:G15,3),0)","v":0}]
[null,"location = IIA",{"$nulls":4},{"$f":"IF(C3=\"IIA\",VLOOKUP(C3,E11:G15,3),0)","v":0}]
[null,"location = III","craft = S",{"$nulls":3},{"$f":"IF(AND(C3=\"III\",D6=\"S\"),VLOOKUP(C5,E16:G19,3),0)","v":0}]
[null,"location = III","craft = M","particular = front",null,null,{"$f":"IF(AND(C3=\"III\",D6=\"M\",C4=\"F\"),VLOOKUP(C5,E20:G24,3),0)","v":0}]
[null,"location = III","craft = M","particular = any",null,null,{"$f":"IF(AND(OR(C5=\"A\",C5=\"B\"),C3=\"III\",D6=\"M\",C4=\"A\"),VLOOKUP(C5,E20:G24,3),0)","v":0}]
[null,"location = III","craft = M","particular = side",null,null,{"$f":"IF(AND(C3=\"III\",C6=\"M\",C4=\"S\"),IF(C5=\"A\",9,IF(C5=\"B\",6,0)))","v":false}]
[null,"location = III","craft = M",{"$nulls":3},{"$f":"IF(C5=\"A\",0,IF(C5=\"B\",0,IF(AND(C3=\"III\",C6=\"M\"),VLOOKUP(C5,E27:G28,3))))","v":false}]
[null,"location = IV",{"$nulls":4},{"$f":"IF(C3=\"IV\",VLOOKUP(D6,D29:G30,4,0),1)","v":1}]
[]
["pressure",{"$nulls":5},{"$f":"MAX(G33:G41)","v":1}]
[]
[]
["minimum thickness"]
[]
[null,"Area",{"$f":"IF(OR('main Side windows 15'!D11=\"IIA\",'main Side windows 15'!D11=\"IIB\"),\"II\",'main Side windows 15'!D11)","v":0},{"$nulls":4},"minimum thickness",null,{"$f":"MAX(J50:J190)","v":0}]
[]
[null,null,"PMMA","A","I",{"$f":" IF('main Side windows 15'!$D$15>0,6 + 0.1*('main Side windows 15'!$D$15-4),\"\")","v":""},{"$nulls":3},{"$f":"IF('main Side windows 15'!$D$17=\"PMMA\",(IF('main Side windows 15'!$D$13=\"A\",VLOOKUP($C$48,$E$50:$F$53,2,-1),0)),0)","v":0}]
["Table 5",{"$nulls":3},"II",6]
[{"$nulls":4},"III",5]
[{"$nulls":4},"IV",5]
[null,null,"PMMA","B","I",{"$f":" IF('main Side windows 15'!$D$15>0,6 + 0.1*('main Side windows 15'!$D$15-4),\"\")","v":""},{"$nulls":3},{"$f":"IF('main Side windows 15'!$D$17=\"PMMA\",(IF('main Side windows 15'!$D$13=\"B\",VLOOKUP($C$48,$E$54:$F$57,2,-1),0)),0)","v":0}]
[{"$nulls":4},"II",6]
[{"$nulls":4},"III",5]
[{"$nulls":4},"IV",5]
[null,null,"PMMA","C","I",{"$f":" IF('main Side windows 15'!$D$15>0,6 + 0.1*('main Side windows 15'!$D$15-4),\"\")","v":""},{"$nulls":3},{"$f":"IF('main Side windows 15'!$D$17=\"PMMA\",(IF('main Side windows 15'!$D$13=\"C\",VLOOKUP($C$48,$E$58:$F$61,2,-1),0)),0)","v":0}]
[{"$nulls":4},"II",6]
[{"$nulls":4},"III",4]
[{"$nulls":4},"IV",4]
[null,null,"PMMA","D","I",{"$f":" IF('main Side windows 15'!$D$15>0,6 + 0.1*('main Side windows 15'!$D$15-4),\"\")","v":""},{"$nulls":3},{"$f":"IF('main Side windows 15'!$D$17=\"PMMA\",(IF('main Side windows 15'!$D$13=\"D\",VLOOKUP($C$48,E62:F65,2,-1),0)),0)","v":0}]
[{"$nulls":4},"II",6]
[{"$nulls":4},"III",4]
[{"$nulls":4},"IV",4]
[null,null,"PC","A","I",{"$f":" IF('main Side windows 15'!$D$15>0,6 + 0.1*('main Side windows 15'!$D$15-4),\"\")","v":""},{"$nulls":3},{"$f":"IF('main Side windows 15'!$D$17=\"PC\",(IF('main Side windows 15'!$D$13=\"A\",VLOOKUP($C$48,E66:F69,2,-1),0)),0)","v":0}]
[{"$nulls":4},"II",6]
[{"$nulls":4},"III",5]
[{"$nulls":4},"IV",5]
[null,null,"PC","B","I",{"$f":" IF('main Side windows 15'!$D$15>0,6 + 0.1*('main Side windows 15'!$D$15-4),\"\")","v":""},{"$nulls":3},{"$f":"IF('main Side windows 15'!$D$17=\"PC\",(IF('main Side windows 15'!$D$13=\"B\",VLOOKUP($C$48,E70:F73,2,-1),0)),0)","v":0}]
[{"$nulls":4},"II",6]
[{"$nulls":4},"III",5]
[{"$nulls":4},"IV",5]
[null,null,"PC","C","I",{"$f":" IF('main Side windows 15'!$D$15>0,6 + 0.1*('main Side windows 15'!$D$15-4),\"\")","v":""},{"$nulls":3},{"$f":"IF('main Side windows 15'!$D$17=\"PC\",(IF('main Side windows 15'!$D$13=\"C\",VLOOKUP($C$48,E74:F77,2,-1),0)),0)","v":0}]
[{"$nulls":4},"II",6]
[{"$nulls":4},"III",4]
[{"$nulls":4},"IV",4]
[null,null,"PC","D","I",{"$f":" IF('main Side windows 15'!$D$15>0,6 + 0.1*('main Side windows 15'!$D$15-4),\"\")","v":""},{"$nulls":3},{"$f":"IF('main Side windows 15'!$D$17=\"PC\",(IF('main Side windows 15'!$D$13=\"D\",VLOOKUP($C$48,E78:F81,2,-1),0)),0)","v":0}]
[{"$nulls":4},"II",6]
[{"$nulls":4},"III",4]
[{"$nulls":4},"IV",4]
[null,null,"TG","A","I",{"$f":" IF('main Side windows 15'!$D$15>0,5+ 0.1*('main Side windows 15'!$D$15-4),\"\")","v":""},{"$nulls":3},{"$f":"IF('main Side windows 15'!$D$17=\"TG\",(IF('main Side windows 15'!$D$13=\"A\",VLOOKUP($C$48,E82:F85,2,-1),0)),0)","v":0}]
[{"$nulls":4},"II",4]
[{"$nulls":4},"III",4]
[{"$nulls":4},"IV",4]
[null,null,"TG","B","I",{"$f":" IF('main Side windows 15'!$D$15>0,5+ 0.1*('main Side windows 15'!$D$15-4),\"\")","v":""},{"$nulls":3},{"$f":"IF('main Side windows 15'!$D$17=\"TG\",(IF('main Side windows 15'!$D$13=\"B\",VLOOKUP($C$48,E86:F89,2,-1),0)),0)","v":0}]
[{"$nulls":4},"II",4]
[{"$nulls":4},"III",4]
[{"$nulls":4},"IV",4]
[null,null,"TG","C","I",{"$f":" IF('main Side windows 15'!$D$15>0,5+ 0.1*('main Side windows 15'!$D$15-4),\"\")","v":""},{"$nulls":3},{"$f":"IF('main Side windows 15'!$D$17=\"TG\",(IF('main Side windows 15'!$D$13=\"C\",VLOOKUP($C$48,E90:F93,2,-1),0)),0)","v":0}]
[{"$nulls":4},"II",4]
[{"$nulls":4},"III",3]
[{"$nulls":4},"IV",3]
[null,null,"TG","D","I",{"$f":" IF('main Side windows 15'!$D$15>0,5+ 0.1*('main Side windows 15'!$D$15-4),\"\")","v":""},{"$nulls":3},{"$f":"IF('main Side windows 15'!$D$17=\"TG\",(IF('main Side windows 15'!$D$13=\"D\",VLOOKUP($C$48,E94:F97,2,-1),0)),0)","v":0}]
[{"$nulls":4},"II",4]
[{"$nulls":4},"III",3]
[{"$nulls":4},"IV",3]
[null,null,"LG","A","I",{"$f":" IF('main Side windows 15'!$D$15>0,5+ 0.1*('main Side windows 15'!$D$15-4),\"\")","v":""},{"$nulls":3},{"$f":"IF('main Side windows 15'!$D$17=\"LG\",(IF('main Side windows 15'!$D$13=\"A\",VLOOKUP($C$48,E98:F101,2,-1),0)),0)","v":0}]
[{"$nulls":4},"II",4]
[{"$nulls":4},"III",4]
[{"$nulls":4},"IV",4]
[null,null,"LG","B","I",{"$f":" IF('main Side windows 15'!$D$15>0,5+ 0.1*('main Side windows 15'!$D$15-4),\"\")","v":""},{"$nulls":3},{"$f":"IF('main Side windows 15'!$D$17=\"LG\",(IF('main Side windows 15'!$D$13=\"B\",VLOOKUP($C$48,E102:F105,2,-1),0)),0)","v":0}]
[{"$nulls":4},"II",4]
[{"$nulls":4},"III",4]
[{"$nulls":4},"IV",4]
[null,null,"LG","C","I",{"$f":" IF('main Side windows 15'!$D$15>0,5+ 0.1*('main Side windows 15'!$D$15-4),\"\")","v":""},{"$nulls":3},{"$f":"IF('main Side windows 15'!$D$17=\"LG\",(IF('main Side windows 15'!$D$13=\"C\",VLOOKUP($C$48,E106:F109,2,-1),0)),0)","v":0}]
[{"$nulls":4},"II",4]
[{"$nulls":4},"III",3]
[{"$nulls":4},"IV",3]
[null,null,"LG","D","I",{"$f":" IF('main Side windows 15'!$D$15>0,5+ 0.1*('main Side windows 15'!$D$15-4),\"\")","v":""},{"$nulls":3},{"$f":"IF('main Side windows 15'!$D$17=\"LG\",(IF('main Side windows 15'!$D$13=\"D\",VLOOKUP($C$48,E110:F113,2,-1),0)),0)","v":0}]
[{"$nulls":4},"II",4]
[{"$nulls":4},"III",3]
[{"$nulls":4},"IV",3]
[null,null,"AMPW","A","I",{"$f":" IF('main Side windows 15'!$D$15>0,8+ 0.1*('main Side windows 15'!$D$15-4),\"\")","v":""},{"$nulls":3},{"$f":"IF('main Side windows 15'!$D$17=\"AMPW\",(IF('main Side windows 15'!$D$13=\"A\",VLOOKUP($C$48,E114:F117,2,-1),0)),0)","v":0}]
[{"$nulls":4},"II",6]
[{"$nulls":4},"III",5]
[{"$nulls":4},"IV",5]
[null,null,"AMPW","B","I",{"$f":" IF('main Side windows 15'!$D$15>0,8+ 0.1*('main Side windows 15'!$D$15-4),\"\")","v":""},{"$nulls":3},{"$f":"IF('main Side windows 15'!$D$17=\"AMPW\",(IF('main Side windows 15'!$D$13=\"B\",VLOOKUP($C$48,E118:F121,2,-1),0)),0)","v":0}]
[{"$nulls":4},"II",6]
[{"$nulls":4},"III",5]
[{"$nulls":4},"IV",5]
[null,null,"AMPW","C","I",{"$f":" IF('main Side windows 15'!$D$15>0,8+ 0.1*('main Side windows 15'!$D$15-4),\"\")","v":""},{"$nulls":3},{"$f":"IF('main Side windows 15'!$D$17=\"AMPW\",(IF('main Side windows 15'!$D$13=\"C\",VLOOKUP($C$48,E122:F125,2,-1),0)),0)","v":0}]
[{"$nulls":4},"II",6]
[{"$nulls":4},"III",4]
[{"$nulls":4},"IV",4]
[null,null,"AMPW","D","I",{"$f":" IF('main Side windows 15'!$D$15>0,8+ 0.1*('main Side windows 15'!$D$15-4),\"\")","v":""},{"$nulls":3},{"$f":"IF('main Side windows 15'!$D$17=\"AMPW\",(IF('main Side windows 15'!$D$13=\"D\",VLOOKUP($C$48,E126:F129,2,-1),0)),0)","v":0}]
[{"$nulls":4},"II",6]
[{"$nulls":4},"III",4]
[{"$nulls":4},"IV",4]
[null,null,"GRP m30","A","I",{"$f":" IF('main Side windows 15'!$D$15>0,6 + 0.1*('main Side windows 15'!$D$15-4),\"\")","v":""},{"$nulls":3},{"$f":"IF('main Side windows 15'!$D$17=\"GRP M30\",(IF('main Side windows 15'!$D$13=\"A\",VLOOKUP($C$48,E130:F133,2,-1),0)),0)","v":0}]
[{"$nulls":4},"II",3]
[{"$nulls":4},"III",3]
[{"$nulls":4},"IV",3]
[null,null,"GRP m30","B","I",{"$f":" IF('main Side windows 15'!$D$15>0,6 + 0.1*('main Side windows 15'!$D$15-4),\"\")","v":""},{"$nulls":3},{"$f":"IF('main Side windows 15'!$D$17=\"GRP M30\",(IF('main Side windows 15'!$D$13=\"B\",VLOOKUP($C$48,E134:F137,2,-1),0)),0)","v":0}]
[{"$nulls":4},"II",3]
[{"$nulls":4},"III",3]
[{"$nulls":4},"IV",3]
[null,null,"GRP m30","C","I",{"$f":" IF('main Side windows 15'!$D$15>0,6 + 0.1*('main Side windows 15'!$D$15-4),\"\")","v":""},{"$nulls":3},{"$f":"IF('main Side windows 15'!$D$17=\"GRP M30\",(IF('main Side windows 15'!$D$13=\"C\",VLOOKUP($C$48,E138:F141,2,-1),0)),0)","v":0}]
[{"$nulls":4},"II",3]
[{"$nulls":4},"III",2]
[{"$nulls":4},"IV",2]
[null,null,"GRP m30","D","I",{"$f":" IF('main Side windows 15'!$D$15>0,6 + 0.1*('main Side windows 15'!$D$15-4),\"\")","v":""},{"$nulls":3},{"$f":"IF('main Side windows 15'!$D$17=\"GRP M30\",(IF('main Side windows 15'!$D$13=\"D\",VLOOKUP($C$48,E142:F145,2,-1),0)),0)","v":0}]
[{"$nulls":4},"II",3]
[{"$nulls":4},"III",2]
[{"$nulls":4},"IV",2]
[null,null,"GRP m35","A","I",{"$f":" IF('main Side windows 15'!$D$15>0,6 + 0.1*('main Side windows 15'!$D$15-4),\"\")","v":""},{"$nulls":3},{"$f":"IF('main Side windows 15'!$D$17=\"GRP M35\",(IF('main Side windows 15'!$D$13=\"A\",VLOOKUP($C$48,E146:F149,2,-1),0)),0)","v":0}]
[{"$nulls":4},"II",3]
[{"$nulls":4},"III",3]
[{"$nulls":4},"IV",3]
[null,null,"GRP m35","B","I",{"$f":" IF('main Side windows 15'!$D$15>0,6 + 0.1*('main Side windows 15'!$D$15-4),\"\")","v":""},{"$nulls":3},{"$f":"IF('main Side windows 15'!$D$17=\"GRP M35\",(IF('main Side windows 15'!$D$13=\"B\",VLOOKUP($C$48,E150:F153,2,-1),0)),0)","v":0}]
[{"$nulls":4},"II",3]
[{"$nulls":4},"III",3]
[{"$nulls":4},"IV",3]
[null,null,"GRP m35","C","I",{"$f":" IF('main Side windows 15'!$D$15>0,6 + 0.1*('main Side windows 15'!$D$15-4),\"\")","v":""},{"$nulls":3},{"$f":"IF('main Side windows 15'!$D$17=\"GRP M35\",(IF('main Side windows 15'!$D$13=\"C\",VLOOKUP($C$48,E154:F157,2,-1),0)),0)","v":0}]
[{"$nulls":4},"II",3]
[{"$nulls":4},"III",2]
[{"$nulls":4},"IV",2]
[null,null,"GRP m35","D","I",{"$f":" IF('main Side windows 15'!$D$15>0,6 + 0.1*('main Side windows 15'!$D$15-4),\"\")","v":""},{"$nulls":3},{"$f":"IF('main Side windows 15'!$D$17=\"GRP M35\",(IF('main Side windows 15'!$D$13=\"D\",VLOOKUP($C$48,E158:F161,2,-1),0)),0)","v":0}]
[{"$nulls":4},"II",3]
[{"$nulls":4},"III",2]
[{"$nulls":4},"IV",2]
[null,null,"Al 5038","A","I",{"$f":" IF('main Side windows 15'!$D$15>0,3 + 0.05*('main Side windows 15'!$D$15-4),\"\")","v":""},{"$nulls":3},{"$f":"IF('main Side windows 15'!$D$17=\"Al 5038\",(IF('main Side windows 15'!$D$13=\"A\",VLOOKUP($C$48,E162:F165,2,-1),0)),0)","v":0}]
[{"$nulls":4},"II",3]
[{"$nulls":4},"III",3]
[{"$nulls":4},"IV",3]
[null,null,"Al 5038","B","I",{"$f":" IF('main Side windows 15'!$D$15>0,3 + 0.05*('main Side windows 15'!$D$15-4),\"\")","v":""},{"$nulls":3},{"$f":"IF('main Side windows 15'!$D$17=\"AL 5038\",(IF('main Side windows 15'!$D$13=\"B\",VLOOKUP($C$48,E166:F169,2,-1),0)),0)","v":0}]
[{"$nulls":4},"II",3]
[{"$nulls":4},"III",3]
[{"$nulls":4},"IV",3]
[null,null,"Al 5038","C","I",{"$f":" IF('main Side windows 15'!$D$15>0,3 + 0.05*('main Side windows 15'!$D$15-4),\"\")","v":""},{"$nulls":3},{"$f":"IF('main Side windows 15'!$D$17=\"AL 5038\",(IF('main Side windows 15'!$D$13=\"C\",VLOOKUP($C$48,E170:F173,2,-1),0)),0)","v":0}]
[{"$nulls":4},"II",3]
[{"$nulls":4},"III",2]
[{"$nulls":4},"IV",2]
[null,null,"Al 5038","D","I",{"$f":" IF('main Side windows 15'!$D$15>0,3 + 0.05*('main Side windows 15'!$D$15-4),\"\")","v":""},{"$nulls":3},{"$f":"IF('main Side windows 15'!$D$17=\"AL 5038\",(IF('main Side windows 15'!$D$13=\"D\",VLOOKUP($C$48,E174:F177,2,-1),0)),0)","v":0}]
[{"$nulls":4},"II",3]
[{"$nulls":4},"III",2]
[{"$nulls":4},"IV",2]
[null,null,"MS","A","I",{"$f":" IF('main Side windows 15'!$D$15>0,2.5 + 0.025*('main Side windows 15'!$D$15-4),\"\")","v":""},{"$nulls":3},{"$f":"IF('main Side windows 15'!$D$17=\"MS\",(IF('main Side windows 15'!$D$13=\"A\",VLOOKUP($C$48,E178:F181,2,-1),0)),0)","v":0}]
[{"$nulls":4},"II",2.5]
[{"$nulls":4},"III",2.5]
[{"$nulls":4},"IV",2.5]
[null,null,"MS","B","I",{"$f":" IF('main Side windows 15'!$D$15>0,2.5 + 0.025*('main Side windows 15'!$D$15-4),\"\")","v":""},{"$nulls":3},{"$f":"IF('main Side windows 15'!$D$17=\"MS\",(IF('main Side windows 15'!$D$13=\"B\",VLOOKUP($C$48,E182:F185,2,-1),0)),0)","v":0}]
[{"$nulls":4},"II",2.5]
[{"$nulls":4},"III",2.5]
[{"$nulls":4},"IV",2.5]
[null,null,"MS","C","I",{"$f":" IF('main Side windows 15'!$D$15>0,2.5 + 0.025*('main Side windows 15'!$D$15-4),\"\")","v":""},{"$nulls":3},{"$f":"IF('main Side windows 15'!$D$17=\"MS\",(IF('main Side windows 15'!$D$13=\"C\",VLOOKUP($C$48,E186:F189,2,-1),0)),0)","v":0}]
[{"$nulls":4},"II",2.5]
[{"$nulls":4},"III",2.5]
[{"$nulls":4},"IV",2.5]
[null,null,"MS","D","I",{"$f":" IF('main Side windows 15'!$D$15>0,2.5 + 0.025*('main Side windows 15'!$D$15-4),\"\")","v":""},{"$nulls":3},{"$f":"IF('main Side windows 15'!$D$17=\"MS\",(IF('main Side windows 15'!$D$13=\"D\",VLOOKUP($C$48,E190:F193,2,-1),0)),0)","v":0}]
[{"$nulls":4},"II",2.5]
[{"$nulls":4},"III",2.5]
[{"$nulls":4},"IV",2.5]